{"text_format":"1","workbook":"xlsx","n_sheets":17,"sheets":["About","Dashboard Graphics","Dashboard","Attributes (T1)","Likes (P1,1)","Values Checklist (T2)","Key Values (T3)","Benefits (T4)","Negatives (T5)","Threats (T6)","Worst threat (T7)","Scorecard (T8)","Responses","ConditTrend (T9)","Recomm (T10)","Str & Challenges (T11)","GEF METT"],"not_rendered":{"charts":10,"images":10,"macros":1,"external_links":2,"defined_names":0,"comments":20,"pivot_tables":0},"unopened":[],"bounds":{"document_bytes":16777216,"sheet_cells":100000,"rows_first":2000,"rows_last":500,"rows_between":2000,"halvings":0,"cell_chars":16384,"cell_head_chars":4096},"cells_cut":0,"cells_raw":0,"read":"whole","date_system":"1900"}

{"sheet":"About","index":0,"n_rows":19,"n_cols":9,"rows_kept":19,"cut":false,"hidden":false,"merged":[[16,1,16,2],[16,3,16,4],[17,1,17,2],[17,3,17,4],[18,1,18,2],[18,3,18,4]]}
[]
[]
[null,null,null,null,null,null,null,null,{"$f":"'Attributes (T1)'!C3","v":0}]
[]
[]
[]
[]
[]
{"$rows_left_out":12}
{"sheet":"Dashboard Graphics","index":1,"n_rows":26,"n_cols":5,"rows_kept":26,"cut":false,"hidden":false,"merged":[]}
[]
[]
[]
[]
[]
[]
[]
[]
{"$rows_left_out":19}
{"sheet":"Dashboard","index":2,"n_rows":134,"n_cols":9,"rows_kept":134,"cut":false,"hidden":false,"merged":[]}
["Category","Issue","Possible Score","Score","Possible Weighted Score","Weighted Score",null,null,"Categories for reporting"]
["Planning","1. Legal status",{"$f":"'Scorecard (T8)'!G3","v":3},{"$f":"'Scorecard (T8)'!F3","v":0},{"$f":"'Scorecard (T8)'!I3","v":3},{"$f":"'Scorecard (T8)'!J3","v":0},null,null,"Design & establishment"]
["Planning","2. PA objectives ",{"$f":"'Scorecard (T8)'!G4","v":3},{"$f":"'Scorecard (T8)'!F4","v":0},{"$f":"'Scorecard (T8)'!I4","v":3},{"$f":"'Scorecard (T8)'!J4","v":0},null,null,"Planning & objectives"]
["Process","3. PA regulations or customary laws/rules",{"$f":"'Scorecard (T8)'!G5","v":3},{"$f":"'Scorecard (T8)'!F5","v":2},{"$f":"'Scorecard (T8)'!I5","v":3},{"$f":"'Scorecard (T8)'!J5","v":2},null,null,"Legislation, control & enforcement"]
["Governance","3a. Clearly defined rules",{"$f":"'Scorecard (T8)'!G6","v":3},{"$f":"'Scorecard (T8)'!F6","v":0},{"$f":"'Scorecard (T8)'!I6","v":1.5},{"$f":"'Scorecard (T8)'!J6","v":0},null,null,"Legislation, control & enforcement"]
["Governance","3b. Clearly defined user/access rights ",{"$f":"'Scorecard (T8)'!G7","v":3},{"$f":"'Scorecard (T8)'!F7","v":2},{"$f":"'Scorecard (T8)'!I7","v":0.75},{"$f":"'Scorecard (T8)'!J7","v":0.5},null,null,"Legislation, control & enforcement"]
["Governance","3c. Awareness of user/access rights",{"$f":"'Scorecard (T8)'!G8","v":3},{"$f":"'Scorecard (T8)'!F8","v":1},{"$f":"'Scorecard (T8)'!I8","v":0.75},{"$f":"'Scorecard (T8)'!J8","v":0.25},null,null,"Legislation, control & enforcement"]
["Planning","4. Planning for land use or coastal/marine activities that occur outside the PA",{"$f":"'Scorecard (T8)'!G9","v":1},{"$f":"'Scorecard (T8)'!F9","v":0},{"$f":"'Scorecard (T8)'!I9","v":1},{"$f":"'Scorecard (T8)'!J9","v":0},null,null,"Planning & objectives"]
{"$rows_left_out":127}
{"sheet":"Attributes (T1)","index":3,"n_rows":81,"n_cols":3,"rows_kept":81,"cut":false,"hidden":false,"merged":[[0,0,0,3]]}
["Protected area attributes (Table 1)"]
[null,"Question","Kuglkane Ranges Protected Zone"]
[]
[1,"Country","Papua New Guinea"]
[2,"Location of protected area","Kuglkane Ranges Protected Zone is located adjacent to Mt Wilhelm National Park  in Gembogl District. The size of the possible extension area is not known but the area is made up of mountain ranges and the area covers the north-west side of the national park that shares a.......????? (Please fix this). Womatne village is the centre of the six council wards of Mitnande Local Level Government which is in the Gembogl District and is accessible by vehicle or on foot. It takes 40 to 50 minutes by vehicle from Kundiawa town to Womatne and another 10 minutes by vehicle to Ward 16 and Ward 17 central village which is Womkama. It will then take 30 minutes by foot or by vehicle it would take 10 minutes to reach Ward 14 and 15 which is Kurunugl.It will then take 15 minutes drive from Kurunugl to Ward 12 and 13 central village called Bongugo."]
["2a","Province(s)","Simbu"]
["2b","District/s","Gembogl"]
["2c","Local level government(s)","Mitnande"]
{"$rows_left_out":74}
{"sheet":"Likes (P1,1)","index":4,"n_rows":3,"n_cols":9,"rows_kept":3,"cut":false,"hidden":false,"merged":[[0,0,0,1]]}
["Protected area description - \"What I like about the protected area\""]
["PA Name","Description of values",null,null,null,null,null,null,"I have cropped the image and lightened it (picture format, corrections) - makes it a bit easier to read. Can you also include a map of the proposed area if you have one (i.e. insert here)"]
["Kuglkane Ranges Proteced Zone","We have two stones, one is called floating stone. From afar it looks like it is floating. One stone sits on the other'. 'We have Living water (Korongo). It makes you live longer and also original - magic water. Hunters pass by and respect the water by not making any noise'.  'Many lake/hidden waters  are found in the area - Heart Lake is red in color. Thse are restricted lakes'."]

{"sheet":"Values Checklist (T2)","index":5,"n_rows":54,"n_cols":7,"rows_kept":54,"cut":false,"hidden":false,"merged":[[0,0,0,6]]}
["Checklist of protected area values and benefits (Table 2)"]
["Q. No.","(Summary Question)","Question: Does the protected area:","Answer (click on arrow)","Score","Total score possible","Comment (to help explain the score)"]
[1,"Biodiversity","Provide for biodiversity (i.e. have many different kinds of plants, animals and ecosystems)?","A lot",2,2]
[2,"Special plants & animals","Have species of plants and animals listed as vulnerable, endangered or critically endangered","Some",1,1,"Tree kangaroo, Bird of Paradise, grass wallaby"]
[3,"Locally endemic plants or animal spp","Have species of plants or animals found only in the protected area or nearby locations?","Some",1,1,"Flowering fern plant, grass - Wayamaia - (White Kapuk)"]
[4,"Important ecosystems","Contain important ecosystems (e.g. wetlands, grasslands, coral reefs etc)? ","A lot",2,2,"Highland grassland, lakes, boulders"]
[5,"Protect clean, fresh water","Protect clean, fresh water?","A lot",2,2,"Still intact"]
[6,"Religious or spiritual significance","Have religious or spiritual significance (e.g. tambu places, sacred sites)?","Some",1,1,"Use foot tracks for hunting and checking the war relics of World War 2"]
{"$rows_left_out":47}
{"sheet":"Key Values (T3)","index":6,"n_rows":9,"n_cols":3,"rows_kept":9,"cut":false,"hidden":false,"merged":[[0,0,0,2],[1,0,2,0]]}
["Protected area values (Table 3)"]
["No.","Key values ","Brief description "]
[null,"(e.g. only known breeding area for the PNG Heron)","(e.g. large freshwater wetland areas immediately above high tide provide nesting sites and food for rearing chicks. Island location means no interference from feral animals or from vehicles)."]
[1,"Biodiversity ","Protect alphine grassland and plains, plants and wildlife"]
[2,"Floating stone","One big flat stone sitting on-top of another stone and from afar the stones look like they are floating on water and hanging on-top"]
[3,"Dragon stone (teme kombuglo)","Looks like the shape of a dragon and has two wings,  two legs and has an open mouth and has a tail"]
[4,"Heart lake","Red in color and heart shaped and there is a sharp boulder (tauia kaulang) beside the lake"]
[5,"War relics","Chain and cement under the ground"]
{"$rows_left_out":2}
{"sheet":"Benefits (T4)","index":7,"n_rows":11,"n_cols":3,"rows_kept":11,"cut":false,"hidden":false,"merged":[[0,0,0,2],[1,0,2,0]]}
["Protected area benefits (Table 4)"]
["No.","Benefit/Positive","Brief description "]
[]
[1,"Absorb excess carbon","Forests provide carbon sink"]
[2,"Animal recovery and increase","Increase in population of important animals such as cassowary"]
[3,"Clean water","provide clean water for local communities and Kundiawa township"]
[4,"Tourism activities","forests and beautiful scenic mountain views attracts tourists "]
[5,"Cultural practises","suppy materials such as bird feathers and plant leaves called tangets that are worn during tradtional singsing"]
{"$rows_left_out":4}
{"sheet":"Negatives (T5)","index":8,"n_rows":9,"n_cols":3,"rows_kept":9,"cut":false,"hidden":false,"merged":[[0,0,0,2],[1,0,2,0]]}
["Protected area negative impacts (Table 5)"]
["No.","Negative impact ","Brief description "]
[null,"(e.g. restrictions on fishing)","(explain why this is a negative)"]
[1,"Stop cutting down of trees","No building materials from trees to build houses, fence"]
[2,"Stop hunting","Restriction placed on hunting will result in less supply of protein for consumption"]
[3,"Protecting habitats may promote increase in dangerous species eg; snakes","Provide refuge to other animals that will have negative impact on the other  animals and the communites"]
[4,"Tempoarty restictions of use of trational materials","Eg; bird feathers"]
[5,"Restriction/limiting the free use of the forest to all","Eg; free hunting access by all"]
{"$rows_left_out":2}
{"sheet":"Threats (T6)","index":9,"n_rows":72,"n_cols":13,"rows_kept":72,"cut":false,"hidden":false,"merged":[[69,0,71,0],[0,0,0,9],[32,0,38,0],[39,0,42,0],[43,0,50,0],[51,0,54,0],[55,0,63,0],[64,0,68,0],[3,0,6,0],[7,0,12,0],[13,0,15,0],[16,0,19,0],[20,0,25,0],[26,0,31,0]]}
["Detailed assessment of threats (Table 6)",null,null,null,null,null,null,null,null,null,null,"Meaning of ratings"]
["Threat category\n","Threat ","Description ","Threat extent ","Threat extent score","Threat severity ","Threat severity score","Management response now","Future management response ","Notes includings values affected"]
[null,"Sub-categories of threat","If the threat is present, insert details of the threat in the PA","Select from pull down menu","Insert score: VH=4; H=3; M=2; L=1","Select from pull down menu (leave blank if not applicable)","Insert score: VH=4; H=3; M=2; L=1","List the management responses that are occurring NOW","List what management needs to do to address the threat","Write additional information here",null,"Extent rating","Meaning: the threat is…."]
["1: Housing and commercial development within a protected area\nThreats from human settlements or other non-agricultural land uses","1.1 Housing and settlement ","If the threat is present, insert details of the threat to the PA in this columnm. So every low, medium high etc MUST have a comment in this column - to help the reader understand what the threat is.","Low",1,"Low",1,"Nothing at the moment","If a threat is present please write something here to indicate what is planned for the future. If people do not think anything needs to be done, just say so.","It is managable by the communities as they cut trees near their homes to build houses",null,"Very high (4)","widespread and affects the value throughout the PA "]
[null,"1.2 Commercial and industrial areas",null,"select",{"$f":"_xlfn.IFS(D5=\"select\",\" \",D5=\"very high\",4, D5=\"high\",3,D5=\"medium\",2,D5=\"low\",1, D5=\"none\",0)","v":" "},"select",{"$f":"_xlfn.IFS(F5=\"select\",\" \",F5=\"very high\",4, F5=\"high\",3,F5=\"medium\",2,F5=\"low\",1)","v":" "},null,null,"NA",null,"High (3)","widespread and affects the value at many locations "]
[null,"1.3 Tourism and recreation infrastructure (e.g. structures)",null,"Low",1,"Low",1,"Nil",null,"NA",null,"Medium (2)","localised and affects the value at some locations"]
[null,"1.4 Population increase in the protected area community","Important to know population numbers, growth rate - is there a census? So please fill all these rows in.","Very high",4,"High",3,"Nil","Carry out more education awareness on high population growth",null,null,"Low (1)","localised and found in only limited locations and the impact on our values is limited"]
["2: Agriculture and aquaculture within a protected area\nThreats to the proteted area from all kinds of farming and grazing including plantations, forestry and fishing","2.1 Customary landowner and community gardens and small crops",null,"Medium",2,"Low",1,"Nil",null,null,null,"None (0)","threat is not present"]
{"$rows_left_out":65}
{"sheet":"Worst threat (T7)","index":10,"n_rows":8,"n_cols":4,"rows_kept":8,"cut":false,"hidden":false,"merged":[[1,3,2,3],[0,0,0,1]]}
["Worst threats (Table 7)"]
["Rank order","Threat","Threat number ","Additional comments"]
[null,"(most significant first)","(copy from Table 6 e.g. 11.1)"]
[1,"Lack of coordination across all levels of government.",13.1,"A project is brought to the area by one arm of the government and does not complete its phase, then leaves and then the arm of government brings in another project to work at the same area."]
[2,"Deliberate destructive activities or threats to the land by individual landowners in a protectd area",6.5,"Landowners destroy their own land and forest as they think that they are the owners and no one will have a say."]
[3,"Fire and fire management suppression (including deliberate fires)",7.2,"Some time ago there was a bush fire and the men had to go up to the bush for a week to put out the fires"]
[4,"Habitat Clearing",7.1,"Landslides during the rain season destroys homes, gardens, animals and the environment"]
[5,"Landslides/Avalanches",10.3,"Destroy homes, gradens,environment,kills animals and people"]
{"$rows_left_out":1}
{"sheet":"Scorecard (T8)","index":11,"n_rows":99,"n_cols":14,"rows_kept":99,"cut":false,"hidden":false,"merged":[[0,1,0,13]]}
[null,"METT Scorecard (Table 8)"]
["Category","Issue","Question","Select response (from pull down menu)","Response","Score","Possible score ","Weighting","Possible Weighted Score","Weighted score","Evidence & Justification (Reasons for choosing the response)","Actions to improve management","Information Source (Select from pull down menu)","Comments on information source (add additional sources here)"]
["Planning","1. Legal status","Does the protected area have legal status or is it established under “other effective means”? (e.g. in the case of private reserves is it covered by a covenant or similar)? ","A. The protected area is not gazetted/approved by national or provincial government or has not been established through ‘other effective means’",{"$f":"VLOOKUP(D3,Responses!B2:D7,2,FALSE)","v":"A"},{"$f":"VLOOKUP(E3,Responses!C2:E7,2,FALSE)","v":0},3,1,{"$f":"G3*H3","v":3},{"$f":"IF(F3=\"not relevant\",\" \",F3*H3)","v":0},"Area is outside of Mt Wilhelm National Park. The community are now deciding to protect the area.","So what needs to happen next?",null,"Please use the pull down menu in column M to indicate the source of information - I guess this would be customary knowledge in this case. Please fix for all empty cells."]
["Planning","2. Protected area objectives ","Is protected area management based on agreed objectives?","A. No firm objectives have been agreed for the protected area to guide management",{"$f":"VLOOKUP(D4,Responses!B8:D13,2,FALSE)","v":"A"},{"$f":"VLOOKUP(E4,Responses!C8:E13,2,FALSE)","v":0},{"$f":"IF(F4=\"not relevant\",0,3)","v":3},1,{"$f":"G4*H4","v":3},{"$f":"IF(F4=\"not relevant\",\" \",F4*H4)","v":0},"It is not a gazetted protected area yet.","So what needs to happen next?"]
["Process","3. Protected area regulations or customary laws/rules","Are laws, rules or agreements in place to manage land or marine use and activities in the protected area in accordance with the management objectives? (includes hunting, logging, mining, fishing)","C. Regulations or customary laws for managing land use and activities in the protected area exist, but there are some weaknesses or gaps",{"$f":"VLOOKUP(D5,Responses!B14:D19,2,FALSE)","v":"C"},{"$f":"VLOOKUP(E5,Responses!C14:E19,2,FALSE)","v":2},3,1,3,2,"Customary laws-elderly people advised the people to not cross borders as this will create disputes between other clans - tumbunas says when you go to the forest do not cut tress unnecessarily but do selective cutting of few trees only","no regulation and monitoring and enforcement of customary laws DO YOU MEAN - there is a need for regulation ….........etc>","customary knowledge/Community opinion"]
["Governance","3a. Clearly defined rules","Are the rules/laws/regulations relating to the protected area clearly defined and documented?","A. Protected area-related rules/laws/regulations are not clearly defined and documented",{"$f":"VLOOKUP(D6,Responses!B20:D25,2,FALSE)","v":"A"},{"$f":"VLOOKUP(E6,Responses!C20:E25,2,FALSE)","v":0},3,0.5,1.5,0,"Cutomary laws are passed on from ancestors to the current generation","document (write/record) tradtional stories for our children and future generation"]
["Governance","3b. Clearly defined user/access rights ","Are the rights of people to use the protected area and its resources clearly defined and documented?","C. Most of the user/access rights to access resources from the protected area are clearly defined and documented",{"$f":"VLOOKUP(D7,Responses!B26:D31,2,FALSE)","v":"C"},{"$f":"VLOOKUP(E7,Responses!C26:E31,2,FALSE)","v":2},3,0.25,0.75,0.5,"Access rights are known by everyone. They are not documented but are passed down from the ancestors.","More awareness of acess rights to be carried out in communites - community awareness-village court"]
["Governance","3c. Awareness of user/access rights","What percentage of adults in the protected area and local community are aware of their user/access rights (e.g. to hunt, collect, fish etc)","B.   Some (25-50%)",{"$f":"VLOOKUP(D8,Responses!B32:D37,2,FALSE)","v":"B "},{"$f":"VLOOKUP(E8,Responses!C32:E37,2,FALSE)","v":1},3,0.25,0.75,0.25,"Less than half the people are aware of their user/access rights relating to cutting down of trees or colleting anything from the bush. Can you say anything about which people/groups of people are the most well-informed? Who is not informed?","Awareness is done by the individuals or groups in public - also environment groups (NGO) conducting awareness. Hausman play a vital role in communication (CAN YOU EXPLAIN THIS) - some areas effective and other areas not effective. We need to improve community halls/resource centres so that information is passed to everyone in the community or village."]
{"$rows_left_out":92}
{"sheet":"Responses","index":12,"n_rows":348,"n_cols":9,"rows_kept":348,"cut":false,"hidden":false,"merged":[]}
["Question",null,null,null,null,null,null,"Condition","Trend"]
[1,"select","blank","blank","select","blank",null,"Very good","Increasing"]
[null,"A. The protected area is not gazetted/approved by national or provincial government or has not been established through ‘other effective means’","A",0,"Yes",1,null,"Good","Stable"]
[null,"B. There is agreement that the protected area should be established but the process has not begun","B ",1,"No",0,null,"Fair","Decreasing"]
[null,"C. The protected area is in the process of being established, but the process is incomplete","C",2,"Not relevant","NA",null,"Poor","Don't know"]
[null,"D. The protected area has been formally gazetted/approved by the national or provincial government or established through ‘other effective means’","D",3,null,null,null,"Don't know"]
[]
[2,"select","blank","blank"]
{"$rows_left_out":341}
{"sheet":"ConditTrend (T9)","index":13,"n_rows":16,"n_cols":7,"rows_kept":16,"cut":false,"hidden":false,"merged":[[0,0,0,4]]}
["Detailed assessment of values (Condition & Trend) (Table 9)"]
["Key value ","Condition","Trend","Justification for the rating","Ways to improve the value",null,"Condition"]
["Values will be inserted from Table 3","Insert Score ","Insert Score","Insert text to explain the score or rating that was selected",null,null,"VG"]
[null,"Select from pull down menu","Select from pull down menu",null,null,null,"G"]
[{"$f":"'Key Values (T3)'!B4","v":"Biodiversity "},"Very good","Stable","Local knowledge that the biodiversity is in good state","Protect alphine grassland and plains, plants and wildlife",null,"F"]
["Floating stone","Very good","Stable","Local knowledged that the floating stone is in good condition","Area to be protected under conservation - certain restrictions to be put in place - distance - control glass thrown in the grassland that causes bush fires",null,"P"]
["Dragon stone (teme kombuglo)","Very good","Stable","Local knowledged that the dragone stone is in good condition","Area to be protected under conservation - certain restrictions to be put in place - distance - control glass thrown in the grassland that causes bush fires"]
["Heart Lake (Nigltekepangua)","Fair","Don't know","Local knowledge of some changes- plant grew in the lake and the color was red previously - but now the plant has died and color has changed to normal water color as when more people frequent the area","Lessen number of people going to the lake-bush fires to be controlled - will increase wild ducks",null,"DK"]
{"$rows_left_out":9}
{"sheet":"Recomm (T10)","index":14,"n_rows":3,"n_cols":7,"rows_kept":3,"cut":false,"hidden":false,"merged":[[0,0,0,2]]}
["Recommendations (Table 10)"]
["Recommendations",1,2,3,4,5,6]
[{"$f":"'Attributes (T1)'!C10","v":"Kuglkane Ranges Proteced Zone"},"CEPA as the national government agency to provide, support and work together with the local communities to gazette the proposed area.","3 Arms of government (Chimbu Provincial govt, Kundiawa Gembolg, District Development Authority -under MP leadership","To establish and support sub committees for each of the 6 wards to lead conservation work on the ground."]

{"sheet":"Str & Challenges (T11)","index":15,"n_rows":11,"n_cols":3,"rows_kept":11,"cut":false,"hidden":false,"merged":[[0,0,0,2]]}
["Strengths and Challenges (Table 11)"]
[{"$f":"'Attributes (T1)'!C10","v":"Kuglkane Ranges Proteced Zone"},{"$f":"'Attributes (T1)'!C10","v":"Kuglkane Ranges Proteced Zone"}]
["Strengths","Challenges"]
["The local communities from the six wards are fully in support of the idea of conservation. They are passionate about their environment and want it to be managed sustainably to benefit the current population and their children.","Maintaining the values of their protected area against the emerging market demands e.g. the flowering fern plant which is in demand  and is bought at a very high price."]
["The proposed area boundary is adjacent to the current Mt Wihelm Protected Area so there is a potential to extend the Mt Wihelm PA boundary into the Kuglkane Ranges Protected Zone.","To get the different landowning clans to come to an agreement for conservation.","Clarify the challenge -does it mean that some prefer alternative forms of development??? Just need to clarify this."]
["There are four existing walking tracks that can be fully recognised and utilised by tourists. This can generate income for the locals and be a coservation incentive.","Get the four tracks fully recognised by tour operators.","To someone who is unfamiliar with the site, this is not clear. So please write a few more details. What is the challenge - lack of money, lack of willingness ????"]
["Natural values remain in a good condition????"]
["Cultural values are important and are passed onto future generations"]
{"$rows_left_out":4}
{"sheet":"GEF METT","index":16,"n_rows":164,"n_cols":7,"rows_kept":164,"cut":false,"hidden":false,"merged":[[162,1,162,4],[162,5,162,6],[163,1,163,4],[163,5,163,6],[159,1,159,4],[159,5,159,6],[160,1,160,4],[160,5,160,6],[161,1,161,4],[161,5,161,6],[155,0,155,6],[156,0,156,6],[157,1,157,4],[157,5,157,6],[158,1,158,4],[158,5,158,6],[150,1,150,6],[128,1,128,6],[130,1,130,6],[132,1,132,6],[134,1,134,6],[136,1,136,6],[138,1,138,6],[140,1,140,6],[142,1,142,6],[144,1,144,6],[146,1,146,6],[148,1,148,6],[126,1,126,6],[104,1,104,6],[106,1,106,6],[108,1,108,6],[110,1,110,6],[112,1,112,6],[114,1,114,6],[116,1,116,6],[118,1,118,6],[120,1,120,6],[122,1,122,6],[124,1,124,6],[102,1,102,6],[80,1,80,6],[82,1,82,6],[84,1,84,6],[86,1,86,6],[88,1,88,6],[90,1,90,6],[92,1,92,6],[94,1,94,6],[96,1,96,6],[98,1,98,6],[100,1,100,6],[78,1,78,6],[59,1,59,5],[60,1,60,5],[61,1,61,5],[62,1,62,5],[63,1,63,5],[64,1,64,5],[65,1,65,5],[66,1,66,5],[71,0,71,6],[74,1,74,6],[76,1,76,6],[58,1,58,5],[47,0,47,6],[48,1,48,5],[49,1,49,5],[50,1,50,5],[51,1,51,5],[52,1,52,5],[53,1,53,5],[54,1,54,5],[55,1,55,5],[56,1,56,5],[57,1,57,5],[46,0,46,6],[0,0,2,6],[3,0,3,6],[4,0,4,6],[5,0,5,6],[6,0,6,6],[8,0,8,6],[9,0,10,0],[9,1,9,5],[9,6,10,6],[34,0,34,6],[35,0,35,6]]}
["Tracking Tool for GEF-6 Biodiversity Projects"]
[]
[]
["GEF:6 Objective 1: Catalyzing Sustainability of Protected Area Systems"]
["SECTION II: Management Effectiveness Tracking Tool for Protected Areas "]
["Note: Please complete the management effectiveness tracking tool for EACH protected area that is the target of the GEF intervention to improve management effectiveness and create a new worksheet for each.\n\nStructure and content of the Tracking Tool - Objective 1. Section II:\nThe Tracking Tool has five data sheets:\nData Sheet 1: Records details of the assessment and some basic information about the site, such as name, size and location etc. \nData Sheet 2: Provides a specific list of threats that the project is addressing.\nData Sheet 3: Condition of biodiversity in the protected area.\nData Sheet 4: Assessment Form: the assessment is structured around 30 questions presented in table format which includes three columns for recording details of the assessment, all of which should be completed.\nData Sheet 5: Datasources and methods on which above assessments of condition of biodiversity in the protected area in Question 30 are based."]
["PLEASE NOTE THAT THIS TOOL IS FOR USE ONLY IN GEF-6 PROJECTS"]
[]
{"$rows_left_out":156}