{"text_format":"1","workbook":"xlsx","n_sheets":17,"sheets":["About","Dashboard Graphics","Dashboard","Attributes (T1)","Values Checklist (T2)","Values (P1,1)","Key Values (T3)","Benefits (T4)","Negatives (T5)","Threats (T6)","Worst threat (T7)","Scorecard (T8)","Responses","ConditTrend (T9)","Recomm (T10)","Str & Challenges (T11)","GEF METT"],"not_rendered":{"charts":10,"images":9,"macros":1,"external_links":1,"defined_names":0,"comments":0,"pivot_tables":0},"unopened":[],"bounds":{"document_bytes":16777216,"sheet_cells":100000,"rows_first":2000,"rows_last":500,"rows_between":2000,"halvings":0,"cell_chars":16384,"cell_head_chars":4096},"cells_cut":0,"cells_raw":0,"read":"whole","date_system":"1900"}

{"sheet":"About","index":0,"n_rows":19,"n_cols":9,"rows_kept":19,"cut":false,"hidden":false,"merged":[[16,1,16,2],[16,3,16,4],[17,1,17,2],[17,3,17,4],[18,1,18,2],[18,3,18,4]]}
[]
[]
[null,null,null,null,null,null,null,null,{"$f":"'Attributes (T1)'!C3","v":"Name of PA (enter here)"}]
[]
[]
[]
{"$rows_left_out":14}
{"sheet":"Dashboard Graphics","index":1,"n_rows":26,"n_cols":5,"rows_kept":26,"cut":false,"hidden":false,"merged":[]}
[]
[]
[]
[]
[]
[]
{"$rows_left_out":21}
{"sheet":"Dashboard","index":2,"n_rows":134,"n_cols":9,"rows_kept":134,"cut":false,"hidden":false,"merged":[]}
["Category","Issue","Possible Score","Score","Possible Weighted Score","Weighted Score",null,null,"Categories for reporting"]
["Planning","1. Legal status",{"$f":"'Scorecard (T8)'!G3","v":3},{"$f":"'Scorecard (T8)'!F3","v":0},{"$f":"'Scorecard (T8)'!I3","v":3},{"$f":"'Scorecard (T8)'!J3","v":0},null,null,"Design & establishment"]
["Planning","2. PA objectives ",{"$f":"'Scorecard (T8)'!G4","v":3},{"$f":"'Scorecard (T8)'!F4","v":2},{"$f":"'Scorecard (T8)'!I4","v":3},{"$f":"'Scorecard (T8)'!J4","v":2},null,null,"Planning & objectives"]
["Process","3. PA regulations or customary laws/rules",{"$f":"'Scorecard (T8)'!G5","v":3},{"$f":"'Scorecard (T8)'!F5","v":0},{"$f":"'Scorecard (T8)'!I5","v":3},{"$f":"'Scorecard (T8)'!J5","v":0},null,null,"Legislation, control & enforcement"]
["Governance","3a. Clearly defined rules",{"$f":"'Scorecard (T8)'!G6","v":3},{"$f":"'Scorecard (T8)'!F6","v":1},{"$f":"'Scorecard (T8)'!I6","v":1.5},{"$f":"'Scorecard (T8)'!J6","v":0.5},null,null,"Legislation, control & enforcement"]
["Governance","3b. Clearly defined user/access rights ",{"$f":"'Scorecard (T8)'!G7","v":3},{"$f":"'Scorecard (T8)'!F7","v":1},{"$f":"'Scorecard (T8)'!I7","v":0.75},{"$f":"'Scorecard (T8)'!J7","v":0.25},null,null,"Legislation, control & enforcement"]
{"$rows_left_out":129}
{"sheet":"Attributes (T1)","index":3,"n_rows":75,"n_cols":3,"rows_kept":75,"cut":false,"hidden":false,"merged":[[0,0,0,3]]}
["Protected area attributes (Table 1)"]
[null,"Question","Your answer"]
[null,null,"Name of PA (enter here)"]
[1,"Country","Papua New Guinea"]
[2,"Location of protected area","The Proposed protected area is located south west of Mt Wilhelm near Gembogl Station PLEASE NOTE can you please include information about what is around the PA and something about the topography - in the mountains, some rivers etc - look at a map and from what you see, describe the location."]
["2a","Province(s)","Simbu "]
{"$rows_left_out":70}
{"sheet":"Values Checklist (T2)","index":4,"n_rows":54,"n_cols":8,"rows_kept":54,"cut":false,"hidden":false,"merged":[[0,0,0,6]]}
["Checklist of protected area values and benefits (Table 2)"]
["Q. No.","(Summary Question)","Question: Does the protected area:","Answer (click on arrow)","Score","Total score possible","Comment (to help explain the score)"]
[1,"Biodiversity","Provide for biodiversity (i.e. have many different kinds of plants, animals and ecosystems)?","A lot",{"$f":"_xlfn.IFS(D3=\"click on arrow\",\" \",D3=\"a lot\",2,D3=\"some\",1,D3=\"none\",0,D3=\"Don't know\",\" DK\")","v":2},2,"The landowners know and sure of the area - it has a lot of different species of plants and animals.We need to know what in particular - can you find out any further information or get some answers from other questions in the METT?"]
[2,"Special plants & animals","Have species of plants and animals listed as vulnerable, endangered or critically endangered","Some",{"$f":"_xlfn.IFS(D4=\"click on arrow\",\" \",D4=\"a lot\",2,D4=\"some\",1,D4=\"none\",0,D4=\"Don't know\",\" DK\")","v":1},2,"they used to see and understand their presence in the area (Not sure what this means - can you please explain further). Special animals include cassowaries, tree kangaroos, bird of paradise etc (why are they special e.g. for food, customs). Plants such as Mountain pines are important as they can burn as a result of logging","Please note I have changed the way these Q are answered - from they have to we have"]
[3,"Locally endemic plants or animal spp","Have species of plants or animals found only in the protected area or nearby locations?","Some",{"$f":"_xlfn.IFS(D5=\"click on arrow\",\" \",D5=\"a lot\",2,D5=\"some\",1,D5=\"none\",0,D5=\"Don't know\",\" DK\")","v":1},2,"There are dwarf cassowaries, but we are not sure sbout other types of animamls if they are endemic of not"]
[4,"Important ecosystems","Contain important ecosystems (e.g. wetlands, grasslands, coral reefs etc)? ","Some",{"$f":"_xlfn.IFS(D6=\"click on arrow\",\" \",D6=\"a lot\",2,D6=\"some\",1,D6=\"none\",0,D6=\"Don't know\",\" DK\")","v":1},2,"There are grasslands, tropical forest and other aquatic areas"]
{"$rows_left_out":49}
{"sheet":"Values (P1,1)","index":5,"n_rows":4,"n_cols":2,"rows_kept":4,"cut":false,"hidden":false,"merged":[[0,0,0,1]]}
["Protected area description - \"What I like about the protected area\""]
["PA Name","Description of values"]
[null,"Insert text - this should include the words spoken by the PA representative(s) when they describe what they like about their PA"]
[{"$f":"'Attributes (T1)'!C10","v":"Kuraglba Conservation Area Is it actually recognised - it the scorecard Q 1 you say it is proposed - so this needs to be very clear as to its status."},"\"We get everything in our PA, the fresh water for drinking, washing, cooking, the woods and ropes for building house, the protein we eat mostly comes from our PA... Most of us, our entire life depends upon Kuraglba Protected Area\". Kuraglba Mountain range connects with Mt William which adds more value to Mt Wilhelm and makes Mt Wilhelm more beautiful and more valueable in terms of conservation. Animal species include walabies, tree kangaroo, cuscus, wild dog, cassowary, birds including birds of paradise, butterflies and freshwater fish. Plant species include grasslands, montane forest tress such as podocarps. Sacred sites include the pool with red colored water and the waterfall which often makes a big sound (and is an indicator of death)."]

{"sheet":"Key Values (T3)","index":6,"n_rows":19,"n_cols":3,"rows_kept":19,"cut":false,"hidden":false,"merged":[[0,0,0,2],[1,0,2,0]]}
["Protected area values (Table 3)"]
["No.","Key values ","Brief description "]
[null,"(e.g. only known breeding area for the PNG Heron)","(e.g. large freshwater wetland areas immediately above high tide provide nesting sites and food for rearing chicks. Island location means no interference from feral animals or from vehicles)."]
[1,"clean water","Used for drinking, washing clothes, cooking food, It's also the catchment for the famous wara simbu within Kundiawa town."]
[2,"trees and plants","There are important for building houses, firehood for cooking,making  furniture, rope (bushropes) and bilums and they produce habitat for animals."]
[3,"animals","Important animals are birds, tree kangaroos and cuscus, which are used for making traditional costumes and their flesh is eaten. Animals have a lot of uses. "]
{"$rows_left_out":14}
{"sheet":"Benefits (T4)","index":7,"n_rows":13,"n_cols":3,"rows_kept":13,"cut":false,"hidden":false,"merged":[[0,0,0,2],[1,0,2,0]]}
["Protected area benefits (Table 4)"]
["No.","Benefit/Positive","Brief description "]
[]
[1,"Land boundaries are identified","The external boundaries of Inaugl land are known and a map is in place. This reduces conflicts or issues over land boundaries."]
[2,"Resource ownership is known","Resource ownershhip within Inaugl are identified and known. In other words, as the land boundaries is identified all the resources within its land boundaries are also idnetified and known. "]
[3,"Kuralgba Conservation area is legally protected","People at higher level such as, the LLG and councilors have recognised or are aware of the Conservation Area including the communities around the areas. Thus, unsustainable activities in the area are closely monitored or discouraged."]
{"$rows_left_out":8}
{"sheet":"Negatives (T5)","index":8,"n_rows":10,"n_cols":3,"rows_kept":10,"cut":false,"hidden":false,"merged":[[0,0,0,2],[1,0,2,0]]}
["Protected area negative impacts (Table 5)"]
["No.","Negative impact ","Brief description "]
[null,"(e.g. restrictions on fishing)","(explain why this is a negative)"]
[1,"Restriction on other unsustainable practices of harvesting and hunting ","Not all families or locals are satisfied with their level of consumption of resources."]
[2,"Restriction on harvesting specific local timber materials that is important to the locals","Some of these things are important and are commonly used by the locals"]
[3,"Refusal of lucrative mineral resource development ","Mining is destruction of the natural environment and most likely will affect the PA. Conflict arrises amongst locals in relation to resource development projects."]
{"$rows_left_out":5}
{"sheet":"Threats (T6)","index":9,"n_rows":72,"n_cols":13,"rows_kept":72,"cut":false,"hidden":false,"merged":[[69,0,71,0],[0,0,0,9],[32,0,38,0],[39,0,42,0],[43,0,50,0],[51,0,54,0],[55,0,63,0],[64,0,68,0],[3,0,6,0],[7,0,12,0],[13,0,15,0],[16,0,19,0],[20,0,25,0],[26,0,31,0]]}
["Detailed assessment of threats (Table 6)",null,null,null,null,null,null,null,null,null,null,"Meaning of ratings"]
["Threat category\n","Threat ","Description ","Threat extent ","Threat extent score","Threat severity ","Threat severity score","Management response now","Future management response ","Notes including values affected"]
[null,"Sub-categories of threat","If the threat is present, insert details of the threat in the PA","Select from pull down menu","Insert score: VH=4; H=3; M=2; L=1","Select from pull down menu (leave blank if not applicable)","Insert score: VH=4; H=3; M=2; L=1","List the management responses that are occurring NOW","List what management needs to do to address the threat","Write additional information here",null,"Extent rating","Meaning: the threat is…."]
["1: Housing and commercial development within a protected area\nThreats from human settlements or other non-agricultural land uses","1.1 Housing and settlement ","No","select",{"$f":"_xlfn.IFS(D4=\"select\",\" \",D4=\"very high\",4, D4=\"high\",3,D4=\"medium\",2,D4=\"low\",1, D4=\"none\",0)","v":" "},"select",{"$f":"_xlfn.IFS(F4=\"select\",\" \",F4=\"very high\",4, F4=\"high\",3,F4=\"medium\",2,F4=\"low\",1)","v":" "},null,null,null,null,"Very high (4)","widespread and affects the value throughout the PA "]
[null,"1.2 Commercial and industrial areas","No","select",{"$f":"_xlfn.IFS(D5=\"select\",\" \",D5=\"very high\",4, D5=\"high\",3,D5=\"medium\",2,D5=\"low\",1, D5=\"none\",0)","v":" "},"select",{"$f":"_xlfn.IFS(F5=\"select\",\" \",F5=\"very high\",4, F5=\"high\",3,F5=\"medium\",2,F5=\"low\",1)","v":" "},null,null,null,null,"High (3)","widespread and affects the value at many locations "]
[null,"1.3 Tourism and recreation infrastructure (e.g. structures)","No","select",{"$f":"_xlfn.IFS(D6=\"select\",\" \",D6=\"very high\",4, D6=\"high\",3,D6=\"medium\",2,D6=\"low\",1, D6=\"none\",0)","v":" "},"select",{"$f":"_xlfn.IFS(F6=\"select\",\" \",F6=\"very high\",4, F6=\"high\",3,F6=\"medium\",2,F6=\"low\",1)","v":" "},null,null,null,null,"Medium (2)","localised and affects the value at some locations"]
{"$rows_left_out":67}
{"sheet":"Worst threat (T7)","index":10,"n_rows":6,"n_cols":4,"rows_kept":6,"cut":false,"hidden":false,"merged":[[1,3,2,3],[0,0,0,1]]}
["Worst threats (Table 7)"]
["Rank order","Threat","Threat number ","Additional comments"]
[null,"(most significant first)","(copy from Table 6 e.g. 11.1)"]
[1,"Fire and fire management suppression (including deliberate fires)",7.2,"This threat is significant because it often occurrs during the dry season, and the burning usually coveres large areas of grassland and this destroys certain insects and animals speceis including their habitats."]
[2,"Roads",4.0999999999999996,"At the moment a road project is underway which will connect Simbu province and Madang via Gembogl District. The road will expose the protected area, as some part of the PA will be partly destroyed. Additionally in the future when the raod is complete people passing by will have a chance to access the area without any consultation or permision to gain access."]
[3,"introduced (pest) plants",8.1,"introduced plants such as strong pitpit"]
{"$rows_left_out":1}
{"sheet":"Scorecard (T8)","index":11,"n_rows":99,"n_cols":14,"rows_kept":99,"cut":false,"hidden":false,"merged":[[0,1,0,13]]}
[null,"METT Scorecard (Table 8)"]
["Category","Issue","Question","Select response (from pull down menu)","Response","Score","Possible score ","Weighting","Possible Weighted Score","Weighted score","Evidence & Justification (Reasons for choosing the response)","Actions to improve management","Information Source (Select from pull down menu)","Comments on information source (add additional sources here)"]
["Planning","1. Legal status","Does the protected area have legal status or is it established under “other effective means”? (e.g. in the case of private reserves is it covered by a covenant or similar)? ","A. The protected area is not gazetted/approved by national or provincial government or has not been established through ‘other effective means’",{"$f":"VLOOKUP(D3,Responses!B2:D7,2,FALSE)","v":"A"},{"$f":"VLOOKUP(E3,Responses!C2:E7,2,FALSE)","v":0},3,1,{"$f":"G3*H3","v":3},{"$f":"IF(F3=\"not relevant\",\" \",F3*H3)","v":0},"it’s a proposed area This needs to be clarified (when section in Attributes is fixed). I am unsure whether there is some sort of deed agreement (which you say was signed in 2018) or there is actually nothing in place.","Liaise with WCS to get  the area protected.","customary knowledge/Community opinion","customary and community oppoinion are also part of the information source"]
["Planning","2. Protected area objectives ","Is protected area management based on agreed objectives?","C. The protected area has agreed objectives, and is only partly managed according to these objectives",{"$f":"VLOOKUP(D4,Responses!B8:D13,2,FALSE)","v":"C"},{"$f":"VLOOKUP(E4,Responses!C8:E13,2,FALSE)","v":2},{"$f":"IF(F4=\"not relevant\",0,3)","v":3},1,{"$f":"G4*H4","v":3},{"$f":"IF(F4=\"not relevant\",\" \",F4*H4)","v":2},"There are agreed objective but they are not documented. How were they agreed? Who agreed?","Review and update the objectives and include in the management plan to enhance management of the area.","customary knowledge/Community opinion","expert oppinion are also incorporated"]
["Process","3. Protected area regulations or customary laws/rules","Are laws, rules or agreements in place to manage land or marine use and activities in the protected area in accordance with the management objectives? (includes hunting, logging, mining, fishing)","A. There are no regulations or customary laws or agreements for managing land and marine use and activities in the protected area ",{"$f":"VLOOKUP(D5,Responses!B14:D19,2,FALSE)","v":"A"},{"$f":"VLOOKUP(E5,Responses!C14:E19,2,FALSE)","v":0},3,1,3,0,"There are several customary sites or values that have customary laws (Tambu site) and that are linked to conservation or sustainable practices of using the natural resources.OK so customary laws are an important form of laws, rules, agreements -so we need to know some of the detail about these - is this possible? However, there are no conservation laws or agreement, or awareness, in the form of laws and regulations made and documented as yet.","Prepare and complete a management plan and raise awareness with the community about this document.","customary knowledge/Community opinion","expert oppinion are also incorporated"]
["Governance","3a. Clearly defined rules","Are the rules/laws/regulations relating to the protected area clearly defined and documented?","B. Some protected area-related rules/laws/ regulations are clearly defined and documented, but there are some important gaps",{"$f":"VLOOKUP(D6,Responses!B20:D25,2,FALSE)","v":"B "},{"$f":"VLOOKUP(E6,Responses!C20:E25,2,FALSE)","v":1},3,0.5,1.5,0.5,"its been clearly defined but not yet documented (This is unclear - previous Q says there are no regulations or customary laws etc and this answer says that some laws etc are clearly  defined and documented - so something is not right here - should the previous Q be changed???) It is quite important to get a sense of what the existing rules relate to.","Review and document all relevant rules, laws and regulations, including within the proposed Management Plan.","customary knowledge/Community opinion","expert oppinion are also incorporated"]
{"$rows_left_out":94}
{"sheet":"Responses","index":12,"n_rows":348,"n_cols":9,"rows_kept":348,"cut":false,"hidden":true,"merged":[]}
["Question",null,null,null,null,null,null,"Condition","Trend"]
[1,"select","blank","blank","select","blank",null,"Very good","Increasing"]
[null,"A. The protected area is not gazetted/approved by national or provincial government or has not been established through ‘other effective means’","A",0,"Yes",1,null,"Good","Stable"]
[null,"B. There is agreement that the protected area should be established but the process has not begun","B ",1,"No",0,null,"Fair","Decreasing"]
[null,"C. The protected area is in the process of being established, but the process is incomplete","C",2,"Not relevant","NA",null,"Poor","Don't know"]
[null,"D. The protected area has been formally gazetted/approved by the national or provincial government or established through ‘other effective means’","D",3,null,null,null,"Don't know"]
{"$rows_left_out":343}
{"sheet":"ConditTrend (T9)","index":13,"n_rows":13,"n_cols":7,"rows_kept":13,"cut":false,"hidden":false,"merged":[[0,0,0,4]]}
["Detailed assessment of values (Condition & Trend) (Table 9)"]
["Key value ","Condition","Trend","Justification for the rating","Ways to improve the value",null,"Condition"]
["Values will be inserted from Table 3","Insert Score ","Insert Score","Insert text to explain the score or rating that was selected",null,null,"VG"]
[null,"Select from pull down menu","Select from pull down menu",null,null,null,"G"]
[{"$f":"'Key Values (T3)'!B4","v":"clean water"},"Good","Stable","The water is in a good condition, but natural occurrences of landslides sometimes affect the condition of water. Also because of the construction of the road at the moment, the sediment runoff may partly affect the water quality.","more awareness will be carried out this is insufficient - need to know who, why etc? Perhaps you could say - Develop a catchment management plan with all relevant stakeholders (e.g. provincial government, LLGs, Ward and district representatives, road agencies, forestry ........) to identify the main catchment values and policies to ensure high quality water management.",null,"F"]
[{"$f":"'Key Values (T3)'!B5","v":"trees and plants"},"Good","Increasing","The trees are intact but the grasslands are seasonlly burnt (e.g. during the dry season) and this affects most parts of the grasslands. ","more awareness will be carried out PLEASE EXPAND ON THIS AND THE COLLOWING RESPONSES.",null,"P"]
{"$rows_left_out":8}
{"sheet":"Recomm (T10)","index":14,"n_rows":3,"n_cols":7,"rows_kept":3,"cut":false,"hidden":false,"merged":[[0,0,0,2]]}
["Recommendations (Table 10)"]
["Recommendations",1,2,3,4,5,6]
[{"$f":"'Attributes (T1)'!C10","v":"Kuraglba Conservation Area Is it actually recognised - it the scorecard Q 1 you say it is proposed - so this needs to be very clear as to its status."},"Expression of interest from KGWan Eco Habitat Inc. which has been submited via Micheal BONGRO for partnership with CEPA be considered.  So what is being recommended here?","Roles and Responsibilities of Global Environmental Fund (GEF 6) partners be defined in a letter of agreement.Please expand - I am not sure what this means.","Kuraglba Proposed Protected Area be registered with CEPA and declared by 2023."]

{"sheet":"Str & Challenges (T11)","index":15,"n_rows":7,"n_cols":2,"rows_kept":7,"cut":false,"hidden":false,"merged":[[0,0,0,2]]}
["Strengths and Challenges (Table 11)"]
[{"$f":"'Attributes (T1)'!C10","v":"Kuraglba Conservation Area Is it actually recognised - it the scorecard Q 1 you say it is proposed - so this needs to be very clear as to its status."},{"$f":"'Attributes (T1)'!C10","v":"Kuraglba Conservation Area Is it actually recognised - it the scorecard Q 1 you say it is proposed - so this needs to be very clear as to its status."}]
["Strengths","Challenges"]
["The Proposed Protected Area shares a corridore with the famous Mt. William National Parm and other mountain ranges that connect to other Provinces (Madang, Eastern Highlands). The area has beautiful scenery and is home to thousands of different species of plants and animlas that remain in a relatively good condition.","Maintaining the biodiversity values in the face of increasing population and lack of support from other stakeholders and government bodies."]
["The Proposed Protected Areas has in place its zoning maps that were initiated by the landowners. This minimzes incompatible activities in the Protected Area. The zoning indicates areas outside the PA which can be accessd and used by the locals for other purposes. ","No proper research and data collection that can be used to keep record for the boidiversity and the protected area at large to use for other future assessments or protected area information for sustainable development activities."]
["There are cultural and traditional links to the land were people avoid entering which adds more value to the protected area. ","Establishing protected area in the face of  Environment illiterate people. "]
{"$rows_left_out":2}
{"sheet":"GEF METT","index":16,"n_rows":164,"n_cols":7,"rows_kept":164,"cut":false,"hidden":false,"merged":[[162,1,162,4],[162,5,162,6],[163,1,163,4],[163,5,163,6],[159,1,159,4],[159,5,159,6],[160,1,160,4],[160,5,160,6],[161,1,161,4],[161,5,161,6],[155,0,155,6],[156,0,156,6],[157,1,157,4],[157,5,157,6],[158,1,158,4],[158,5,158,6],[150,1,150,6],[128,1,128,6],[130,1,130,6],[132,1,132,6],[134,1,134,6],[136,1,136,6],[138,1,138,6],[140,1,140,6],[142,1,142,6],[144,1,144,6],[146,1,146,6],[148,1,148,6],[126,1,126,6],[104,1,104,6],[106,1,106,6],[108,1,108,6],[110,1,110,6],[112,1,112,6],[114,1,114,6],[116,1,116,6],[118,1,118,6],[120,1,120,6],[122,1,122,6],[124,1,124,6],[102,1,102,6],[80,1,80,6],[82,1,82,6],[84,1,84,6],[86,1,86,6],[88,1,88,6],[90,1,90,6],[92,1,92,6],[94,1,94,6],[96,1,96,6],[98,1,98,6],[100,1,100,6],[78,1,78,6],[59,1,59,5],[60,1,60,5],[61,1,61,5],[62,1,62,5],[63,1,63,5],[64,1,64,5],[65,1,65,5],[66,1,66,5],[71,0,71,6],[74,1,74,6],[76,1,76,6],[58,1,58,5],[47,0,47,6],[48,1,48,5],[49,1,49,5],[50,1,50,5],[51,1,51,5],[52,1,52,5],[53,1,53,5],[54,1,54,5],[55,1,55,5],[56,1,56,5],[57,1,57,5],[46,0,46,6],[0,0,2,6],[3,0,3,6],[4,0,4,6],[5,0,5,6],[6,0,6,6],[8,0,8,6],[9,0,10,0],[9,1,9,5],[9,6,10,6],[34,0,34,6],[35,0,35,6]]}
["Tracking Tool for GEF-6 Biodiversity Projects"]
[]
[]
["GEF:6 Objective 1: Catalyzing Sustainability of Protected Area Systems"]
["SECTION II: Management Effectiveness Tracking Tool for Protected Areas "]
["Note: Please complete the management effectiveness tracking tool for EACH protected area that is the target of the GEF intervention to improve management effectiveness and create a new worksheet for each.\n\nStructure and content of the Tracking Tool - Objective 1. Section II:\nThe Tracking Tool has five data sheets:\nData Sheet 1: Records details of the assessment and some basic information about the site, such as name, size and location etc. \nData Sheet 2: Provides a specific list of threats that the project is addressing.\nData Sheet 3: Condition of biodiversity in the protected area.\nData Sheet 4: Assessment Form: the assessment is structured around 30 questions presented in table format which includes three columns for recording details of the assessment, all of which should be completed.\nData Sheet 5: Datasources and methods on which above assessments of condition of biodiversity in the protected area in Question 30 are based."]
{"$rows_left_out":158}