{"text_format":"1","workbook":"xlsx","n_sheets":17,"sheets":["About","Dashboard Graphics","Dashboard","Attributes (T1)","Likes (P1,1)","Values Checklist (T2)","Key Values (T3)","Benefits (T4)","Negatives (T5)","Threats (T6)","Worst threat (T7)","Scorecard (T8)","Responses","ConditTrend (T9)","Recomm (T10)","Str & Challenges (T11)","GEF METT"],"not_rendered":{"charts":10,"images":10,"macros":1,"external_links":1,"defined_names":0,"comments":0,"pivot_tables":0},"unopened":[],"bounds":{"document_bytes":16777216,"sheet_cells":100000,"rows_first":2000,"rows_last":500,"rows_between":2000,"halvings":0,"cell_chars":16384,"cell_head_chars":4096},"cells_cut":0,"cells_raw":0,"read":"row_number_cap","date_system":"1900"}

{"sheet":"About","index":0,"n_rows":19,"n_cols":9,"rows_kept":19,"cut":false,"hidden":false,"merged":[[16,1,16,2],[16,3,16,4],[17,1,17,2],[17,3,17,4],[18,1,18,2],[18,3,18,4]]}
[]
[]
[null,null,null,null,null,null,null,null,{"$f":"'Attributes (T1)'!C3","v":"Name of PA (enter here)"}]
[]
[]
[]
{"$rows_left_out":14}
{"sheet":"Dashboard Graphics","index":1,"n_rows":26,"n_cols":5,"rows_kept":26,"cut":false,"hidden":false,"merged":[]}
[]
[]
[]
[]
[]
[]
{"$rows_left_out":21}
{"sheet":"Dashboard","index":2,"n_rows":134,"n_cols":12,"rows_kept":134,"cut":false,"hidden":false,"merged":[]}
["Category","Issue","Possible Score","Score","Possible Weighted Score","Weighted Score",null,null,"Categories for reporting"]
["Planning","1. Legal status",{"$f":"'Scorecard (T8)'!G3","v":3},{"$f":"'Scorecard (T8)'!F3","v":0},{"$f":"'Scorecard (T8)'!I3","v":3},{"$f":"'Scorecard (T8)'!J3","v":0},null,null,"Design & establishment"]
["Planning","2. PA objectives ",{"$f":"'Scorecard (T8)'!G4","v":3},{"$f":"'Scorecard (T8)'!F4","v":1},{"$f":"'Scorecard (T8)'!I4","v":3},{"$f":"'Scorecard (T8)'!J4","v":1},null,null,"Planning & objectives"]
["Process","3. PA regulations or customary laws/rules",{"$f":"'Scorecard (T8)'!G5","v":3},{"$f":"'Scorecard (T8)'!F5","v":1},{"$f":"'Scorecard (T8)'!I5","v":3},{"$f":"'Scorecard (T8)'!J5","v":1},null,null,"Legislation, control & enforcement"]
["Governance","3a. Clearly defined rules",{"$f":"'Scorecard (T8)'!G6","v":3},{"$f":"'Scorecard (T8)'!F6","v":0},{"$f":"'Scorecard (T8)'!I6","v":1.5},{"$f":"'Scorecard (T8)'!J6","v":0},null,null,"Legislation, control & enforcement"]
["Governance","3b. Clearly defined user/access rights ",{"$f":"'Scorecard (T8)'!G7","v":3},{"$f":"'Scorecard (T8)'!F7","v":2},{"$f":"'Scorecard (T8)'!I7","v":0.75},{"$f":"'Scorecard (T8)'!J7","v":0.5},null,null,"Legislation, control & enforcement"]
{"$rows_left_out":129}
{"sheet":"Attributes (T1)","index":3,"n_rows":77,"n_cols":3,"rows_kept":77,"cut":false,"hidden":false,"merged":[[0,0,0,2]],"read":"row_number_cap"}
["Protected area attributes (Table 1)"]
[null,"Question","Your answer"]
[null,null,"Name of PA (enter here)"]
[1,"Country","Papua New Guinea"]
[2,"Location of protected area","Madang Lagoon"]
["2a","Province(s)","Madang Province"]
{"$rows_left_out":72}
{"sheet":"Likes (P1,1)","index":4,"n_rows":5,"n_cols":2,"rows_kept":5,"cut":false,"hidden":false,"merged":[[0,0,0,1]]}
["Protected area description - \"What I like about the protected area\""]
["PA Name","Description (of what people like about the PA)"]
[null,"Insert text - this should include the words spoken by the PA representative(s) when they describe what they like about their PA"]
["Industrial Zone- Vidar, Midim","The industrial zone is comprised of six clans - Vidar, St. Fedelis, Midiba, Sek, Alexishafen and Kananam. We are living within the industrial zone where our marine resources badly are affacted by the industrial waste. The coral reefs are badly affacted by the continuous oil spills from the bigger fishing companies. Most reefs area degraded, the fish population is decreasing at an alarming rate due to water ballast from bigger fishing ships, the engine noise of the ships chased away the marine resources and habitat destroyed. Our marine resources are decreasing in numbers. Population increase is another major contribution to the decreasing of our marine resources due to no strict rules and guidelines in place. We have war relices (tanker, planes, machines guns, ships, wharves, airstrip used during WW2) in few sites, We have a catholic historical church built in the 1800s by the German missionies. Before the establishemnt of the RD Cannery Comapnies, the surrounding marine environment was pristines and intact. After the establishment of the RD Cannries our marine environment has been damaged, impacted by the waste from the comapnies. We are located in the impacted site of the Madang Lagoon.  We also have a passage called Narz where it is like our marine highway for all marine resources. Dolphins, sharks, dugong and beautiful coral reefs and fishes are found in this passage. "]
[null,"The text above is good. Well done. With the image (right) - please remember to take the photo so that the image is square - either stick butcher's paper on the wall at eye level or put on the floor and take the image. I have cropped the image, but you can see that it is not squate - so just a comment for next time. I have also included the map (which is referred to in Attributes worksheet."]

{"sheet":"Values Checklist (T2)","index":5,"n_rows":54,"n_cols":7,"rows_kept":54,"cut":false,"hidden":false,"merged":[[0,0,0,6]]}
["Checklist of protected area values and benefits (Table 2)"]
["Q. No.","(Summary Question)","Question: Does the protected area:","Answer (click on arrow)","Score","Total score possible","Comment (to help explain the score)"]
[1,"Biodiversity","Provide for biodiversity (i.e. have many different kinds of plants, animals and ecosystems)?","A lot",{"$f":"(VLOOKUP(D3,Responses!$K$1:$L$5,2,FALSE))","v":2},2,"There is still a lot of marine and freshwater resources, including mangroves within our protected area"]
[2,"Special plants & animals","Have species of plants and animals listed as vulnerable, endangered or critically endangered","Some",{"$f":"(VLOOKUP(D4,Responses!$K$1:$L$5,2,FALSE))","v":1},2,"Most of the marine species of animals are no longer caught like they used to before. We have to travel further out to fish or you will never catch anything."]
[3,"Locally endemic plants or animal spp","Have species of plants or animals found only in the protected area or nearby locations?","None",{"$f":"(VLOOKUP(D5,Responses!$K$1:$L$5,2,FALSE))","v":0},2,"None"]
[4,"Important ecosystems","Contain important ecosystems (e.g. wetlands, grasslands, coral reefs etc)? ","A lot",{"$f":"(VLOOKUP(D6,Responses!$K$1:$L$5,2,FALSE))","v":2},2,"Mangroves, seagrass/weed, coral reefs, sago palms."]
{"$rows_left_out":49}
{"sheet":"Key Values (T3)","index":6,"n_rows":7,"n_cols":4,"rows_kept":7,"cut":false,"hidden":false,"merged":[[0,0,0,2],[1,0,2,0]]}
["Protected area values (Table 3)"]
["No.","Key values ","Brief description "]
[null,"(e.g. only known breeding area for the PNG Heron)","(e.g. large freshwater wetland areas immediately above high tide provide nesting sites and food for rearing chicks. Island location means no interference from feral animals or from vehicles)."]
[1,"Mangroves ecosystem","Mangroves provide us with stems for housing posts, fencing, firewood, breeding ground for all marine animals, act as seawalls against strongs waves and strong winds","This information could go in the values checklist."]
[2,"Sago palms","Sago palms provide us with food and shelter. The sago leaves are used for roof patching and weaving grass skirts, the pagal is used for house walling.","As above"]
[3,"Historical sites (war relics and sacred sites)","We have a few historical sites including: catholic church built in the 1800s by German missionaries, the WW2 relics of tanker and ships, birth and sacred sites that we have high respect for those sites"]
{"$rows_left_out":2}
{"sheet":"Benefits (T4)","index":7,"n_rows":14,"n_cols":3,"rows_kept":14,"cut":false,"hidden":false,"merged":[[0,0,0,2],[1,0,2,0]]}
["Protected area benefits (Table 4)"]
["No.","Benefit/Positive","Brief description "]
[]
[1,"The RD Cannery used to disposed of their waste into the Lagoon, but they have slightly minimisde their waste disposal.","The RD Cannery was developed before Madang Lagoon was declared as a protected area. The industry's waste has been deposited into the Lagoon and this caused skin infections to our kids, diarrhoea and other diseases as well. The establishment of the protected area has brought about some postive feedback from our communities. "]
[2,"Dead fish is not observed anymore","The protected area has brought some positive changes to our communities. The fish kills we used to observe in the past are no longer observed."]
[3]
{"$rows_left_out":9}
{"sheet":"Negatives (T5)","index":8,"n_rows":7,"n_cols":3,"rows_kept":7,"cut":false,"hidden":false,"merged":[[0,0,0,2],[1,0,2,0]]}
["Protected area negative impacts (Table 5)"]
["No.","Negative impact ","Brief description "]
[null,"(e.g. restrictions on fishing)","(explain why this is a negative)"]
[1,"The user rights fishing grounds have been restricted to certain areas.","Certain areas within the protected area is stricted to the user rights (So what is the perceived problem - lack of fish??"]
[2,"Restriction of unsustainable fishing gears/methods","Certain net mesh sizes have been used, hook and line and spear gun only used. Derris roots and dynamite no longer used (I am not clear on why this is a negative - I understand the positive benefits this can bring, but are there some in the community that don't like this - who are they?)"]
[3,"Poachers have increased within the protected area","Conflict arise within communities due to restrictions placed on certain areas."]
{"$rows_left_out":2}
{"sheet":"Threats (T6)","index":9,"n_rows":72,"n_cols":13,"rows_kept":72,"cut":false,"hidden":false,"merged":[[69,0,71,0],[0,0,0,9],[32,0,38,0],[39,0,42,0],[43,0,50,0],[51,0,54,0],[55,0,63,0],[64,0,68,0],[3,0,6,0],[7,0,12,0],[13,0,15,0],[16,0,19,0],[20,0,25,0],[26,0,31,0]]}
["Detailed assessment of threats (Table 6)",null,null,null,null,null,null,null,null,null,null,"Meaning of ratings"]
["Threat category\n","Threat ","Description ","Threat extent ","Threat extent score","Threat severity ","Threat severity score","Management response now","Future management response ","Notes includings values affected"]
[null,"Sub-categories of threat","If the threat is present, insert details of the threat in the PA","Select from pull down menu","Insert score: VH=4; H=3; M=2; L=1","Select from pull down menu (leave blank if not applicable)","Insert score: VH=4; H=3; M=2; L=1","List the management responses that are occurring NOW","List what management needs to do to address the threat","Write additional information here",null,"Extent rating","Meaning: the threat is…."]
["1: Housing and commercial development within a protected area\nThreats from human settlements or other non-agricultural land uses","1.1 Housing and settlement ","In this column there needs to be a description of what the threat is. Column H states what is being managed now and column I is future management. So please describe what the problem is in relation to housing.","High",{"$f":"VLOOKUP(D4,Responses!$G$21:$H$26,2,FALSE)","v":3},"Very high",{"$f":"VLOOKUP(F4,Responses!$G$21:$H$26,2,FALSE)","v":4},"Management actions: 1. The elders in the church have addressed the issue of resettlement within the PA. Those resettlers who settle with more extented families must be evicted. Management Action: 2. Giving eviction orders to outside settlers","There are 2 types of land usage in the PA communiy. The customary and church lands. The church land has bigger portion of land with customary land title than the customary land itself. The  customary land has been occupied by the intermariages which are reserve land within the church land. Managment Actions: Create dialogue with Church Leaders to give back the reserve land to the customary landowners and evict all the foreigners. this will minimise the impact housing settlement have within the PA","Customary Landowner Knowledge",null,"Very high (4)","widespread and affects the value throughout the PA "]
[null,"1.2 Commercial and industrial areas","As above - please describe briefly what the threat is. Please do this for all the threats that have a rating.","Very high",{"$f":"VLOOKUP(D5,Responses!$G$21:$H$26,2,FALSE)","v":4},"Very high",{"$f":"VLOOKUP(F5,Responses!$G$21:$H$26,2,FALSE)","v":4},"Management responses: The clan directors represents the communities by having continuous dialogue with the companies to reduce the impact on the PA. The clan directors are sometimes biased with their decision making because there are paid by the company. its hard to address the impact affecting the PA","Management responses. The only options in the future is to change all the clan directors with new leaders those that can respresent the locals in PA.","Customary Landowner Knowledge",null,"High (3)","widespread and affects the value at many locations "]
[null,"1.3 Tourism and recreation infrastructure (e.g. structures)",null,"select",{"$f":"VLOOKUP(D6,Responses!$G$21:$H$26,2,FALSE)","v":0},"select",{"$f":"VLOOKUP(F6,Responses!$G$21:$H$26,2,FALSE)","v":0},"Management actions: Continous education and awareness on unwanted pregancies as well as family planning. Engagement of local youths to be part of the awareness programs in all the community","Management responses. Invite all the HEALTH ADVOCATES to run the health programs of family planning, unwanted pregnancies, dieseas. Marie Stopes and mary safe haus. Continuous edcationa and awareness","Customary Landowner Knowledge",null,"Medium (2)","localised and affects the value at some locations"]
{"$rows_left_out":67}
{"sheet":"Worst threat (T7)","index":10,"n_rows":6,"n_cols":4,"rows_kept":6,"cut":false,"hidden":false,"merged":[[1,3,2,3],[0,0,0,1]]}
["Worst threats (Table 7)"]
["Rank order","Threat","Threat number ","Additional comments"]
[null,"(most significant first)","(copy from Table 6 e.g. 11.1)"]
[1,"Population increase in the protected area community",1.4,"Too many unwanted pregnancies and population ncrease. Conflicts arise within the PA due to depleting resources and shortage of land"]
[2,"Loss of cultural links, traditional knowledge language, dress, singsings,respect and/or management practices",12.1,"The traditional knowledge and skills is not passed to younger generation by elders. This young generation are interested in western influentials. "]
[3,"Lack of coordination across all levels of government",13.3,"No proper coordination between all relevant authorities in the government sectors"]
{"$rows_left_out":1}
{"sheet":"Scorecard (T8)","index":11,"n_rows":99,"n_cols":14,"rows_kept":99,"cut":false,"hidden":false,"merged":[[0,1,0,13]]}
[null,"METT Scorecard (Table 8)"]
["Category","Issue","Question","Select response (from pull down menu)","Response","Score","Possible score ","Weighting","Possible Weighted Score","Weighted score","Evidence & Justification (Reasons for choosing the response)","Actions to improve management","Information Source (Select from pull down menu)","Comments on information source (add additional sources here)"]
["Planning","1. Legal status","Does the protected area have legal status or is it established under “other effective means”? (e.g. in the case of private reserves is it covered by a covenant or similar)? ","A. The protected area is not gazetted/approved by national or provincial government or has not been established through ‘other effective means’",{"$f":"VLOOKUP(D3,Responses!B2:D7,2,FALSE)","v":"A"},{"$f":"VLOOKUP(E3,Responses!C2:E7,2,FALSE)","v":0},3,1,{"$f":"G3*H3","v":3},{"$f":"IF(F3=\"not relevant\",\" \",F3*H3)","v":0},"There is no effective means to approve this to become legal.","The Government should approve  and legalise it for effective management ","customary knowledge/Community opinion"]
["Planning","2. Protected area objectives ","Is protected area management based on agreed objectives?","B. The protected area has agreed objectives, but is not managed according to these objectives",{"$f":"VLOOKUP(D4,Responses!B8:D13,2,FALSE)","v":"B "},{"$f":"VLOOKUP(E4,Responses!C8:E13,2,FALSE)","v":1},{"$f":"IF(F4=\"not relevant\",0,3)","v":3},1,{"$f":"G4*H4","v":3},{"$f":"IF(F4=\"not relevant\",\" \",F4*H4)","v":1},"Say something about the agreed objectives - what are they, when were they agreed and by whom - e.g. in a plan or by traditional practices etc. There is no funded aid from the government to assist achieve our agreed objectives","We need funding to manage our protected area","customary knowledge/Community opinion"]
["Process","3. Protected area regulations or customary laws/rules","Are laws, rules or agreements in place to manage land or marine use and activities in the protected area in accordance with the management objectives? (includes hunting, logging, mining, fishing)","B. Some regulations or customary laws for managing land/sea use and activities in the protected area exist but there are many weaknesses",{"$f":"VLOOKUP(D5,Responses!B14:D19,2,FALSE)","v":"B "},{"$f":"VLOOKUP(E5,Responses!C14:E19,2,FALSE)","v":1},3,1,3,1,"There are many weaknesses to enforce some strict measures in the protected area due to lack of funds ","We need funds to assist us enforec some strict measures within the protected areas","customary knowledge/Community opinion"]
["Governance","3a. Clearly defined rules","Are the rules/laws/regulations relating to the protected area clearly defined and documented?","A. Protected area-related rules/laws/regulations are not clearly defined and documented",{"$f":"VLOOKUP(D6,Responses!B20:D25,2,FALSE)","v":"A"},{"$f":"VLOOKUP(E6,Responses!C20:E25,2,FALSE)","v":0},3,0.5,1.5,0,"The protected area related rules and laws are not clearly defined therefore the population living within the protected are not aware of the rules and laws of the protected area","We need funding to do continuous education and awareness of the rules and laws of the protected area","customary knowledge/Community opinion"]
{"$rows_left_out":94}
{"sheet":"Responses","index":12,"n_rows":348,"n_cols":12,"rows_kept":348,"cut":false,"hidden":true,"merged":[]}
["Question",null,null,null,null,null,null,"Condition","Trend",null,"select"]
[1,"select","blank","blank","select","blank",null,"Very good","Increasing",null,"A lot",2]
[null,"A. The protected area is not gazetted/approved by national or provincial government or has not been established through ‘other effective means’","A",0,"Yes",1,null,"Good","Stable",null,"Some",1]
[null,"B. There is agreement that the protected area should be established but the process has not begun","B ",1,"No",0,null,"Fair","Decreasing",null,"None",0]
[null,"C. The protected area is in the process of being established, but the process is incomplete","C",2,"Not relevant","NA",null,"Poor","Don't know",null,"Don't know","DK"]
[null,"D. The protected area has been formally gazetted/approved by the national or provincial government or established through ‘other effective means’","D",3,null,null,null,"Don't know"]
{"$rows_left_out":343}
{"sheet":"ConditTrend (T9)","index":13,"n_rows":8,"n_cols":7,"rows_kept":8,"cut":false,"hidden":false,"merged":[[0,0,0,4]]}
["Detailed assessment of values (Condition & Trend) (Table 9)"]
["Key value ","Condition","Trend","Justification for the rating","Ways to improve the value",null,"Condition"]
["Values will be inserted from Table 3","Insert Score ","Insert Score","Insert text to explain the score or rating that was selected",null,null,"VG"]
[null,"Select from pull down menu","Select from pull down menu",null,null,null,"G"]
[{"$f":"'Key Values (T3)'!B4","v":"Mangroves ecosystem"},"Fair","Decreasing","Due to increase population, mangroves overharvested for building materials as well as other uses. ","Nursery of mangrove seedlings and replanting them in degraded sites Mangrove restoration along the coastline ",null,"F"]
[{"$f":"'Key Values (T3)'!B5","v":"Sago palms"},"Fair","Decreasing","Due to increase population, sago palms overharvested for building materials as well as other usage. ","Sago restoration in the wetlands",null,"P"]
{"$rows_left_out":3}
{"sheet":"Recomm (T10)","index":14,"n_rows":3,"n_cols":7,"rows_kept":3,"cut":false,"hidden":false,"merged":[[0,0,0,2]]}
["Recommendations (Table 10)"]
["Recommendations",1,2,3,4,5,6]
[{"$f":"'Attributes (T1)'!C10","v":"Laugum Should this be Madang Lagoon Zone 1?"},"Please insert recommendations"]

{"sheet":"Str & Challenges (T11)","index":15,"n_rows":7,"n_cols":4,"rows_kept":7,"cut":false,"hidden":false,"merged":[[0,0,0,2]]}
["Strengths and Challenges (Table 11)"]
[{"$f":"'Attributes (T1)'!C10","v":"Laugum Should this be Madang Lagoon Zone 1?"},{"$f":"'Attributes (T1)'!C10","v":"Laugum Should this be Madang Lagoon Zone 1?"},"Bagiai Example","Bagiai Example"]
["Strengths","Challenges","Strengths","Challenges"]
["NEED TO COMPLETE - this is for the facilitator and recorder to highlight what they have synthesised as the main strengths and challenges - these then go into the summary document.",null,"The protected area is on Karkar Island and there are relatively few threats and pressures from outside at present. It is an area of outstanding beauty with an active volcano, and steep slopes with a steep slope into the sea.","Maintaining the biodiversity values in the face of expanding landowner gardens, increased harvesting of wildlife and expansion of cocoa/copra plantations into the protected area. "]
[null,null,"The WMA is established and there is a relatively low level of settlement within the protected area. The traditional laws have been incorporated into the WMA and are generally followed, or mediation is undertaken to stop the activity. There is not much difference now than if the WMA had not been introduced, but the government laws can give more strength to the arrangements.","Addressing the impacts of climate change, which is a high level threat with observed changes including increased winds damaging the reefs, increased temperatures causing reef bleaching, and greater risk in travelling by boat across the ocean to other islands and Madang."]
[null,null,"People are closely linked to the land and feel that the land owns them rather than that they own the land.","Achieving effective outcomes with no resources or support from the government or any other organisations. The management committee has not functioned for a long time and there is a low level of awareness among the community members generally."]
{"$rows_left_out":2}
{"sheet":"GEF METT","index":16,"n_rows":164,"n_cols":7,"rows_kept":164,"cut":false,"hidden":false,"merged":[[46,0,46,6],[0,0,2,6],[3,0,3,6],[4,0,4,6],[5,0,5,6],[6,0,6,6],[8,0,8,6],[9,0,10,0],[9,1,9,5],[9,6,10,6],[34,0,34,6],[35,0,35,6],[58,1,58,5],[47,0,47,6],[48,1,48,5],[49,1,49,5],[50,1,50,5],[51,1,51,5],[52,1,52,5],[53,1,53,5],[54,1,54,5],[55,1,55,5],[56,1,56,5],[57,1,57,5],[78,1,78,6],[59,1,59,5],[60,1,60,5],[61,1,61,5],[62,1,62,5],[63,1,63,5],[64,1,64,5],[65,1,65,5],[66,1,66,5],[71,0,71,6],[74,1,74,6],[76,1,76,6],[102,1,102,6],[80,1,80,6],[82,1,82,6],[84,1,84,6],[86,1,86,6],[88,1,88,6],[90,1,90,6],[92,1,92,6],[94,1,94,6],[96,1,96,6],[98,1,98,6],[100,1,100,6],[126,1,126,6],[104,1,104,6],[106,1,106,6],[108,1,108,6],[110,1,110,6],[112,1,112,6],[114,1,114,6],[116,1,116,6],[118,1,118,6],[120,1,120,6],[122,1,122,6],[124,1,124,6],[150,1,150,6],[128,1,128,6],[130,1,130,6],[132,1,132,6],[134,1,134,6],[136,1,136,6],[138,1,138,6],[140,1,140,6],[142,1,142,6],[144,1,144,6],[146,1,146,6],[148,1,148,6],[155,0,155,6],[156,0,156,6],[157,1,157,4],[157,5,157,6],[158,1,158,4],[158,5,158,6],[162,1,162,4],[162,5,162,6],[163,1,163,4],[163,5,163,6],[159,1,159,4],[159,5,159,6],[160,1,160,4],[160,5,160,6],[161,1,161,4],[161,5,161,6]]}
["Tracking Tool for GEF-6 Biodiversity Projects"]
[]
[]
["GEF:6 Objective 1: Catalyzing Sustainability of Protected Area Systems"]
["SECTION II: Management Effectiveness Tracking Tool for Protected Areas "]
["Note: Please complete the management effectiveness tracking tool for EACH protected area that is the target of the GEF intervention to improve management effectiveness and create a new worksheet for each.\n\nStructure and content of the Tracking Tool - Objective 1. Section II:\nThe Tracking Tool has five data sheets:\nData Sheet 1: Records details of the assessment and some basic information about the site, such as name, size and location etc. \nData Sheet 2: Provides a specific list of threats that the project is addressing.\nData Sheet 3: Condition of biodiversity in the protected area.\nData Sheet 4: Assessment Form: the assessment is structured around 30 questions presented in table format which includes three columns for recording details of the assessment, all of which should be completed.\nData Sheet 5: Datasources and methods on which above assessments of condition of biodiversity in the protected area in Question 30 are based."]
{"$rows_left_out":158}