{"text_format":"1","workbook":"xlsx","n_sheets":17,"sheets":["About","Dashboard Graphics","Dashboard","Attributes (T1)","Values (P1,1)","Values Checklist (T2)","Key Values (T3)","Benefits (T4)","Negatives (T5)","Threats (T6)","Worst threat (T7)","Scorecard (T8)","Responses","ConditTrend (T9)","Recomm (T10)","Str & Challenges (T11)","GEF METT"],"not_rendered":{"charts":10,"images":9,"macros":1,"external_links":2,"defined_names":1,"comments":0,"pivot_tables":0},"unopened":[],"bounds":{"document_bytes":16777216,"sheet_cells":100000,"rows_first":2000,"rows_last":500,"rows_between":2000,"halvings":0,"cell_chars":16384,"cell_head_chars":4096},"cells_cut":0,"cells_raw":0,"read":"whole","date_system":"1900"}

{"sheet":"About","index":0,"n_rows":19,"n_cols":9,"rows_kept":19,"cut":false,"hidden":false,"merged":[[16,1,16,2],[16,3,16,4],[17,1,17,2],[17,3,17,4],[18,1,18,2],[18,3,18,4]]}
[]
[]
[null,null,null,null,null,null,null,null,{"$f":"'Attributes (T1)'!C3","v":"Tarobi LMMA"}]
[]
[]
[]
{"$rows_left_out":14}
{"sheet":"Dashboard Graphics","index":1,"n_rows":179,"n_cols":28,"rows_kept":179,"cut":false,"hidden":false,"merged":[[93,22,93,23],[93,26,93,27]]}
[]
[]
[]
[]
[]
[]
{"$rows_left_out":174}
{"sheet":"Dashboard","index":2,"n_rows":134,"n_cols":11,"rows_kept":134,"cut":false,"hidden":false,"merged":[]}
["Category","Issue","Possible Score","Score","Possible Weighted Score","Weighted Score",null,null,"Categories for reporting",null,"  "]
["Planning","1. Legal status",{"$f":"'Scorecard (T8)'!G3","v":3},{"$f":"'Scorecard (T8)'!F3","v":3},{"$f":"'Scorecard (T8)'!I3","v":3},{"$f":"'Scorecard (T8)'!J3","v":3},null,null,"Design & establishment"]
["Planning","2. PA objectives ",{"$f":"'Scorecard (T8)'!G4","v":3},{"$f":"'Scorecard (T8)'!F4","v":2},{"$f":"'Scorecard (T8)'!I4","v":3},{"$f":"'Scorecard (T8)'!J4","v":2},null,null,"Planning & objectives"]
["Process","3. PA regulations or customary laws/rules",{"$f":"'Scorecard (T8)'!G5","v":3},{"$f":"'Scorecard (T8)'!F5","v":1},{"$f":"'Scorecard (T8)'!I5","v":3},{"$f":"'Scorecard (T8)'!J5","v":1},null,null,"Legislation, control & enforcement"]
["Governance","3a. Clearly defined rules",{"$f":"'Scorecard (T8)'!G6","v":3},{"$f":"'Scorecard (T8)'!F6","v":1},{"$f":"'Scorecard (T8)'!I6","v":1.5},{"$f":"'Scorecard (T8)'!J6","v":0.5},null,null,"Legislation, control & enforcement"]
["Governance","3b. Clearly defined user/access rights ",{"$f":"'Scorecard (T8)'!G7","v":3},{"$f":"'Scorecard (T8)'!F7","v":3},{"$f":"'Scorecard (T8)'!I7","v":0.75},{"$f":"'Scorecard (T8)'!J7","v":0.75},null,null,"Legislation, control & enforcement"]
{"$rows_left_out":129}
{"sheet":"Attributes (T1)","index":3,"n_rows":75,"n_cols":3,"rows_kept":75,"cut":false,"hidden":false,"merged":[[0,0,0,3]]}
["Protected area attributes (Table 1)"]
[null,"Question","Your answer"]
[null,null,"Tarobi LMMA"]
[1,"Country","Papua New Guinea"]
[2,"Location of protected area","The LMMA is located in the Central Nakanai LLG Area in Kimbe Bay. The area is accessed by road from Kimbe and by boat to the LMMA. Tarobi village is situated adjacent to the coastline and is isolated from the main highway, which is about 25km to the south. The existing unsealed road to the community is seasonal, often being impassable during the wet season. There are three villages/hamlets, (Valako, Kololo and Kavutu). The LMMA  is made up of the Eastern and Western Tarobi Bays and includes two islands and four reefs, two mangrove sites, one masalai site and one beach."]
["2a","Province(s)","West New Britain"]
{"$rows_left_out":70}
{"sheet":"Values (P1,1)","index":4,"n_rows":4,"n_cols":2,"rows_kept":4,"cut":false,"hidden":false,"merged":[[0,0,0,1]]}
["Protected area description - \"What I like about the protected area\""]
["PA Name","Description of values"]
[null,"Insert text - this should include the words spoken by the PA representative(s) when they describe what they like about their PA"]
[{"$f":"'Attributes (T1)'!C10","v":"Tarobi Locally Managed Marine Area"},"Tarobi LMMA is rich in marine resources. We have too many and invite all to come an see! Our marine resources are still intact. Our mangroves have over grown into mangrove forest. The sea grass area has extended. We have turtle nesting sites, fish spawning sites, a coral network including the 'K1 crater reef', and we are the only place with two varieties of anemones, one from the coral reef and one in the sea-grass because we don't eat them like people do in other sites. Our area is away from the main road and being remote, not many people access the area to remove and destroy our marine resources."]

{"sheet":"Values Checklist (T2)","index":5,"n_rows":29,"n_cols":7,"rows_kept":29,"cut":false,"hidden":false,"merged":[[0,0,0,6]]}
["Checklist of protected area values and benefits (Table 2)"]
["Q. No.","(Summary Question)","Question: Does the protected area:","Answer (click on arrow)","Score","Total score possible","Comment (to help explain the score)"]
[1,"Biodiversity","Provide for biodiversity (i.e. have many different kinds of plants, animals and ecosystems)?","A lot",{"$f":"VLOOKUP(D3,Responses!$K$1:$L$5,2,FALSE)","v":2},2,"There are a diverse range of marine species found in the LMMA, including dugong, fish and turtles. There is also mangroves, seagrass and estuaries and island ecosystems."]
[2,"Special plants & animals","Have species of plants and animals listed as vulnerable, endangered or critically endangered","A lot",{"$f":"VLOOKUP(D4,Responses!$K$1:$L$5,2,FALSE)","v":2},2,"Leatherback turtle, giant clam shells, dugongs and beche-de-mer."]
[3,"Locally endemic plants or animal spp","Have species of plants or animals found only in the protected area or nearby locations?","Some",{"$f":"VLOOKUP(D5,Responses!$K$1:$L$5,2,FALSE)","v":1},2,"Two types of anemones, one in coral reef and one in the seagrass, home of clown fish and sandy bass."]
[4,"Important ecosystems","Contain important ecosystems (e.g. wetlands, grasslands, coral reefs etc)? ","A lot",{"$f":"VLOOKUP(D6,Responses!$K$1:$L$5,2,FALSE)","v":2},2,"The LMMA has coastal ecosystems, mangrove ecosystems, reefs, islands and a few more. There is also a terrestrial wetland/marshland within site."]
{"$rows_left_out":24}
{"sheet":"Key Values (T3)","index":6,"n_rows":8,"n_cols":3,"rows_kept":8,"cut":false,"hidden":false,"merged":[[0,0,0,2],[1,0,2,0]]}
["Protected area values (Table 3)"]
["No.","Key values ","Brief description "]
[null,"(e.g. only known breeding area for the PNG Heron)","(e.g. large freshwater wetland areas immediately above high tide provide nesting sites and food for rearing chicks. Island location means no interference from feral animals or from vehicles)."]
[1,"Mangroves (systems)","Fish and other marine resources, if destroyed it can deplete resources. It also acts as a natural barrier from sea level rising, and used for post/ \"maternity ward\" for marine resources"]
[2,"Sea grass (system)","Fish feeding site, There are nine species identified. Dugongs also come to grace here."]
[3,"Coral systems (corals and reefs)","It provides a dwelling place for a high variety of marine line life. We have almost the highest percent of reef systems in our LMMA from near shore to barrier reef that host a lot of marine life."]
{"$rows_left_out":3}
{"sheet":"Benefits (T4)","index":7,"n_rows":8,"n_cols":3,"rows_kept":8,"cut":false,"hidden":false,"merged":[[0,0,0,2],[1,0,2,0]]}
["Protected area benefits (Table 4)"]
["No.","Benefit/Positive","Brief description "]
[]
[1,"People able to catch fish  much more easier (quicker) now as population has increased, there is spill over etc.","LMMA zones for fishing activities and banning of destructive fishing methods e.g., poison roots. As a result, fish stocks have returned to normal and the coral reef has rehabilitated and created spill-over effect so we can still fish outside the LMMA or in general use zones (in our areas)."]
[2,"Helps control rise in sea level rise and other climate change impacts.","Rehabilitation of mangroves forest has reduced the impact of the rising sea level, also saw increase in seagrass area and increase in marine resources in the mangrove e.g., crabs, shells."]
[3,"Return of the culturally recognised dugong","Dugong are a source of protein and are associated with many cultural stories in Tarobi. Due to over hunting for its meat, the sightings of dugong had decreased. Since the total ban by NFA on harvesting no one is harvesting. Locals also have pledged to stop hunting dugongs. With the LMMA, they have been seeing a return of the dugong. There is a lot of seagrass for the dugong to feed on and people have stopped hunting them."]
{"$rows_left_out":3}
{"sheet":"Negatives (T5)","index":8,"n_rows":5,"n_cols":3,"rows_kept":5,"cut":false,"hidden":false,"merged":[[0,0,0,2],[1,0,2,0]]}
["Protected area negative impacts (Table 5)"]
["No.","Negative impact ","Brief description "]
[null,"(e.g. restrictions on fishing)","(explain why this is a negative)"]
[1,"Reduced and limited accessibility of resources by local owners","Local people with user and access rights now have to abide by the rules of the LMMA. The frequency and freedom to use and harvest in the area is limited now and at times monitored."]
[2,"Disputes/conflicts arising amongst locals (clans and families)","Families/clans having disagreements on use and access rights to zones and sites as a result of restrictions place on them throughout he LMMA. Also resulting in illegal takes."]

{"sheet":"Threats (T6)","index":9,"n_rows":72,"n_cols":13,"rows_kept":72,"cut":false,"hidden":false,"merged":[[69,0,71,0],[0,0,0,9],[32,0,38,0],[39,0,42,0],[43,0,50,0],[51,0,54,0],[55,0,63,0],[64,0,68,0],[3,0,6,0],[7,0,12,0],[13,0,15,0],[16,0,19,0],[20,0,25,0],[26,0,31,0]]}
["Detailed assessment of threats (Table 6)",null,null,null,null,null,null,null,null,null,null,"Meaning of ratings"]
["Threat category\n","Threat ","Description ","Threat extent ","Threat extent score","Threat severity ","Threat severity score","Management response now","Future management response ","Notes including values affected"]
[null,"Sub-categories of threat","If the threat is present, insert details of the threat in the PA","Select from pull down menu","Insert score: VH=4; H=3; M=2; L=1","Select from pull down menu (leave blank if not applicable)","Insert score: VH=4; H=3; M=2; L=1","List the management responses that are occurring NOW","List what management needs to do to address the threat","Write additional information here",null,"Extent rating","Meaning: the threat is…."]
["1: Housing and commercial development within a protected area\nThreats from human settlements or other non-agricultural land uses","1.1 Housing and settlement ","N/A","select",{"$f":"VLOOKUP(D4,[1]Responses!$G$21:$H$26,2,FALSE)","v":0},"select",{"$f":"VLOOKUP(F4,[1]Responses!$G$21:$H$26,2,FALSE)","v":0},null,null,null,null,"Very high (4)","widespread and affects the value throughout the PA "]
[null,"1.2 Commercial and industrial areas","N/A","select",{"$f":"VLOOKUP(D5,[1]Responses!$G$21:$H$26,2,FALSE)","v":0},"select",{"$f":"VLOOKUP(F5,[1]Responses!$G$21:$H$26,2,FALSE)","v":0},null,null,null,null,"High (3)","widespread and affects the value at many locations "]
[null,"1.3 Tourism and recreation infrastructure (e.g. structures)","N/A","select",{"$f":"VLOOKUP(D6,[1]Responses!$G$21:$H$26,2,FALSE)","v":0},"select",{"$f":"VLOOKUP(F6,[1]Responses!$G$21:$H$26,2,FALSE)","v":0},null,null,null,null,"Medium (2)","localised and affects the value at some locations"]
{"$rows_left_out":67}
{"sheet":"Worst threat (T7)","index":10,"n_rows":6,"n_cols":4,"rows_kept":6,"cut":false,"hidden":false,"merged":[[1,3,2,3],[0,0,0,1]]}
["Worst threats (Table 7)"]
["Rank order","Threat","Threat number ","Additional comments"]
[null,"(most significant first)","(copy from Table 6 e.g. 11.1)"]
[1,"Population Increase in the LMMA community and nearby areas",1.4,"With increase in population people are becoming careless, and are returning to doing over fishing, illegal fishing etc. This is a threat. Even women are doing this. Mainly due to increase in needs for cash. We need our management plan and the committee to be resourced"]
[2,"Governance: Lack of coordination across all levels of government",13.3,"Provincial government/LLG to work with TLMMA to review their  management plan, have it finalised, endorsed and included in the ward 8 of the Central Nakanai LLG development plan for funding and support. This should pave way also for the LMMA Activities to go up the government levels. The current situation is not helping the LMMA despite being recognised by the LLG."]
[3,"Climate Change-sea level rise",11.6,"High tide mark has extended and causing extension of seagrass area and affecting turtle nesting sites. "]
{"$rows_left_out":1}
{"sheet":"Scorecard (T8)","index":11,"n_rows":99,"n_cols":14,"rows_kept":99,"cut":false,"hidden":false,"merged":[[0,1,0,13]]}
[null,"METT Scorecard (Table 8)"]
["Category","Issue","Question","Select response (from pull down menu)","Response","Score","Possible score ","Weighting","Possible Weighted Score","Weighted score","Evidence & Justification (Reasons for choosing the response)","Actions to improve management","Information Source (Select from pull down menu)","Comments on information source (add additional sources here)"]
["Planning","1. Legal status","Does the protected area have legal status or is it established under “other effective means”? (e.g. in the case of private reserves is it covered by a covenant or similar)? ","D.   The protected area has been formally gazetted/approved by the national or provincial government or established through ‘other effective means’",{"$f":"VLOOKUP(D3,Responses!B2:D7,2,FALSE)","v":"D"},{"$f":"VLOOKUP(E3,Responses!C17:E22,2,FALSE)","v":3},{"$f":"IF(F3=\"not relevant\",0,3)","v":3},1,{"$f":"G3*H3","v":3},{"$f":"IF(F3=\"not relevant\",\" \",F3*H3)","v":3},"It was recognised under the Bialla Local Level Government Marine Environment Management Law 2004, however Tarobi now comes under the  Central Nakanai LLG so this needs to be transferred/amended. This work needs to be done.","LMMA to be submitted to Central Nakanai LLG for its recognition or some other arrangement needs to be in place.","planning documents & government data","Management plan has to be revised and endorsed through Central Nakanai LLG, JCU has provided expert information as well to develop the plan"]
["Planning","2. Protected area objectives ","Is protected area management based on agreed objectives?","C.   The protected area has agreed objectives, and is only partly managed according to these objectives",{"$f":"VLOOKUP(D4,Responses!B8:D13,2,FALSE)","v":"C"},{"$f":"VLOOKUP(E4,Responses!C18:E23,2,FALSE)","v":2},{"$f":"IF(F4=\"not relevant\",0,3)","v":3},1,{"$f":"G4*H4","v":3},{"$f":"IF(F4=\"not relevant\",\" \",F4*H4)","v":2},"There is an existing Management Plan that has agree objectives.","The current objectives are specific and are ok and should be maintained and updated if the Management plan is to be reviewed.","planning documents & government data"]
["Process","3. Protected area regulations or customary laws/rules","Are laws, rules or agreements in place to manage land or marine use and activities in the protected area in accordance with the management objectives? (includes hunting, logging, mining, fishing)","B.   Some regulations or customary laws for managing land/sea use and activities in the protected area exist but there are many weaknesses",{"$f":"VLOOKUP(D5,Responses!B14:D19,2,FALSE)","v":"B "},{"$f":"VLOOKUP(E5,Responses!C19:E24,2,FALSE)","v":1},3,1,3,1,"Yes, Example the traditional way of Merarobu and some rules in the management plan, like fees paid by non-members of Tarobi community to Tarobi LMMA site committee (TLMMASC) before they use, harvest or fish for any resources within Tarobi LMMA. The fees agreed are:\n• K30.00 for use of marine area or, fish and harvest marine resource\n• K20.00 for terrestrial (land) resources (e.g. beetle nut)","The management plan needs to be revised/updated and endorsed by the CNLLG for full implementation.","planning documents & government data","having a management plan is very important for effective management of LMMA"]
["Governance","3a. Clearly defined rules","Are the rules/laws/regulations relating to the protected area clearly defined and documented?","B.   Some protected area-related rules/laws/ regulations are clearly defined and documented, but there are some important gaps",{"$f":"VLOOKUP(D6,Responses!B20:D25,2,FALSE)","v":"B "},{"$f":"VLOOKUP(E6,Responses!C20:E25,2,FALSE)","v":1},3,0.5,1.5,0.5,"Rules exists as agreed to in the Management plan. The biggest gap is resourcing of the TLMMA committees to effectively implement the rules.","Agree on innovative ways to attract resources to actually implement rules in the Management Plan. Education and awareness on the rules need to be done again.","staff experience"]
{"$rows_left_out":94}
{"sheet":"Responses","index":12,"n_rows":349,"n_cols":12,"rows_kept":349,"cut":false,"hidden":true,"merged":[]}
["Question",null,null,null,null,null,null,"Condition","Trend",null,"select"]
[1,"select","blank","blank","select","blank",null,"Very good","Increasing",null,"A lot",2]
[null,"A.   The protected area is not gazetted/approved by national or provincial government or has not been established through ‘other effective means’","A",0,"Yes",1,null,"Good","Stable",null,"Some",1]
[null,"B.   There is agreement that the protected area should be established but the process has not begun","B ",1,"No",0,null,"Fair","Decreasing",null,"None",0]
[null,"C.   The protected area is in the process of being established, but the process is incomplete","C",2,null,null,null,"Poor","Don't know",null,"Don't know","DK"]
[null,"D.   The protected area has been formally gazetted/approved by the national or provincial government or established through ‘other effective means’","D",3,null,null,null,"Don't know"]
{"$rows_left_out":344}
{"sheet":"ConditTrend (T9)","index":13,"n_rows":9,"n_cols":7,"rows_kept":9,"cut":false,"hidden":false,"merged":[[0,0,0,4]]}
["Detailed assessment of values (Condition & Trend) (Table 9)"]
["Key value ","Condition","Trend","Justification for the rating","Ways to improve the value",null,"Condition"]
["Values will be inserted from Table 3","Insert Score ","Insert Score","Insert text to explain the score or rating that was selected",null,null,"VG"]
[null,"Select from pull down menu","Select from pull down menu",null,null,null,"G"]
[{"$f":"'Key Values (T3)'!B4","v":"Mangroves (systems)"},"Very good","Stable","Given the accessibility of the LMMA, and the  limited and specific use of mangrove (e.g.; material for certain parts of the house)","Nearby villages Karapi, Rapuri, Vavua, Koimumu other Hoskins villages, Sesimi, Kaiamu, Sulu, Bilomi company employees and Mamota residents need to be made aware not to illegally use/harvest mangroves",null,"F"]
[{"$f":"'Key Values (T3)'!B5","v":"Sea grass (system)"},"Very good","Increasing","Unlike many other areas/LMMAs, Tarobi people do not depend on or eat seagrass (i.e. there is reduced taking of this resource)",null,null,"P"]
{"$rows_left_out":4}
{"sheet":"Recomm (T10)","index":14,"n_rows":8,"n_cols":5,"rows_kept":8,"cut":false,"hidden":false,"merged":[[0,0,0,2]]}
["Recommendations (Table 10)"]
["Recommendations",1,2,3,4]
[{"$f":"'Attributes (T1)'!C10","v":"Tarobi Locally Managed Marine Area"},"Review and update the Management Plan, with help/support from relevant stakeholders like CEPA and NFA and have TLMMA also recognise by Central Nakanai LLG","Equipment including boat and outboard motor.","Support from CEPA/GEF (other relevant agencies/NGO/institutions) to conduct capacity building for PA on site at Tarobi (e.g. tourism, money savings, PA management) also research and monitoring of the LMMA","Carryout awareness to nearby villages and settlement blocks"]
[]
["References"]
["Tarobi Management Committee (nd). Tarobi Marine Resource Use and Management Plan for Tarobi LMMA and Tarobi Community, Bialla RLLG, WNBP"]
{"$rows_left_out":3}
{"sheet":"Str & Challenges (T11)","index":15,"n_rows":12,"n_cols":2,"rows_kept":12,"cut":false,"hidden":false,"merged":[[0,0,0,1]]}
["Strengths and Challenges (Table 11)"]
[{"$f":"'Attributes (T1)'!C10","v":"Tarobi Locally Managed Marine Area"},{"$f":"'Attributes (T1)'!C10","v":"Tarobi Locally Managed Marine Area"}]
["Strengths","Challenges"]
["The state of the key values is in a very good condition. This is in part due to the establishment of no take zones (and other zones) and the customary practice of \"Merarobu\", a closure period which can be up to 3 years to honour a death, followed by an opening of the area after customary feasts.","Funding is needed to: review and update the Management Plan; implement training programs and skills development/capacity building (monitoring, surveillance, enforcement, finance, leadership, awareness raising)."]
["Most generations within the community are well aware of the LMMA and its different zones and the reasons for creating the LMMA. This gives them the advantage of understanding the values of their marine environment over those who don't have LMMAs","Negotiating and receiving support from industry (Oil Palm and Logging) whose effluents impacts on the waterways that lead into the LMMA."]
["The LMMA already has a  management plan which is well set up with its objectives, various zones usage types, fines to generate funds for self sustaining etc and is all set up under the LLG laws ","Implementation, enforcement, monitoring, administration."]
{"$rows_left_out":7}
{"sheet":"GEF METT","index":16,"n_rows":174,"n_cols":7,"rows_kept":174,"cut":false,"hidden":false,"merged":[[75,1,75,5],[76,1,76,5],[172,1,172,4],[172,5,172,6],[173,1,173,4],[173,5,173,6],[169,1,169,4],[169,5,169,6],[170,1,170,4],[170,5,170,6],[171,1,171,4],[171,5,171,6],[165,0,165,6],[166,0,166,6],[167,1,167,4],[167,5,167,6],[168,1,168,4],[168,5,168,6],[160,1,160,6],[138,1,138,6],[140,1,140,6],[142,1,142,6],[144,1,144,6],[146,1,146,6],[148,1,148,6],[150,1,150,6],[152,1,152,6],[154,1,154,6],[156,1,156,6],[158,1,158,6],[136,1,136,6],[114,1,114,6],[116,1,116,6],[118,1,118,6],[120,1,120,6],[122,1,122,6],[124,1,124,6],[126,1,126,6],[128,1,128,6],[130,1,130,6],[132,1,132,6],[134,1,134,6],[112,1,112,6],[90,1,90,6],[92,1,92,6],[94,1,94,6],[96,1,96,6],[98,1,98,6],[100,1,100,6],[102,1,102,6],[104,1,104,6],[106,1,106,6],[108,1,108,6],[110,1,110,6],[88,1,88,6],[63,1,63,5],[64,1,64,5],[65,1,65,5],[66,1,66,5],[67,1,67,5],[68,1,68,5],[69,1,69,5],[70,1,70,5],[81,0,81,6],[84,1,84,6],[86,1,86,6],[71,1,71,5],[72,1,72,5],[73,1,73,5],[74,1,74,5],[62,1,62,5],[51,0,51,6],[52,1,52,5],[53,1,53,5],[54,1,54,5],[55,1,55,5],[56,1,56,5],[57,1,57,5],[58,1,58,5],[59,1,59,5],[60,1,60,5],[61,1,61,5],[50,0,50,6],[0,0,2,6],[3,0,3,6],[4,0,4,6],[5,0,5,6],[6,0,6,6],[8,0,8,6],[9,0,10,0],[9,1,9,5],[9,6,10,6],[38,0,38,6],[39,0,39,6]]}
["Tracking Tool for GEF-6 Biodiversity Projects"]
[]
[]
["GEF:6 Objective 1: Catalyzing Sustainability of Protected Area Systems"]
["SECTION II: Management Effectiveness Tracking Tool for Protected Areas "]
["Note: Please complete the management effectiveness tracking tool for EACH protected area that is the target of the GEF intervention to improve management effectiveness and create a new worksheet for each.\n\nStructure and content of the Tracking Tool - Objective 1. Section II:\nThe Tracking Tool has five data sheets:\nData Sheet 1: Records details of the assessment and some basic information about the site, such as name, size and location etc. \nData Sheet 2: Provides a specific list of threats that the project is addressing.\nData Sheet 3: Condition of biodiversity in the protected area.\nData Sheet 4: Assessment Form: the assessment is structured around 30 questions presented in table format which includes three columns for recording details of the assessment, all of which should be completed.\nData Sheet 5: Datasources and methods on which above assessments of condition of biodiversity in the protected area in Question 30 are based."]
{"$rows_left_out":168}